{"text_format":"1","workbook":"xlsx","n_sheets":25,"sheets":["INICIO","PERIODOS E FERIADOS","PREMISSAS","FUNCIONÁRIOS","PLAN MOD","FUNC 1","FUNC 2","FUNC 3","FUNC 4","FUNC 5","FUNC 6","FUNC 7","FUNC 8","FUNC 9","FUNC 10","FUNC 11","FUNC 12","FUNC 13","FUNC 14","FUNC 15","FUNC 16","FUNC 17","FUNC 18","FUNC 19","FUNC 20"],"not_rendered":{"charts":0,"images":2,"macros":1,"external_links":0,"defined_names":27,"comments":2,"pivot_tables":0},"unopened":[],"bounds":{"document_bytes":16777216,"sheet_cells":100000,"rows_first":2000,"rows_last":500,"rows_between":2000,"halvings":0,"cell_chars":16384,"cell_head_chars":4096},"cells_cut":0,"cells_raw":0,"read":"whole","date_system":"1900"}

{"sheet":"INICIO","index":0,"n_rows":15,"n_cols":23,"rows_kept":15,"cut":false,"hidden":false,"merged":[[13,4,13,9],[14,4,14,9],[12,4,12,9],[11,3,11,9],[3,3,3,9],[7,3,7,9],[4,4,4,9],[5,4,5,9],[8,4,8,9],[9,4,9,9]]}
[]
[]
[]
[null,null,null,"PREMISSAS GERAIS"]
[null,null,null,"CAPA","Preencha com o nome da sua Empresa, o periodo que deseja trabalhar e com os feriados do ano."]
[null,null,null,"PREMISSAS","Preenchimento de porcentagens, tolerancia diária e adicional noturno."]
[]
[null,null,null,"CADASTROS"]
[null,null,null,"FUNCIONÁRIOS","Local para preenchimento dos dados dos funcionários (Nº matricula e Nome Completo).",null,null,null,null,null,null,null,null,null,null,null,null,null,null,null,null,null,{"$f":"IF($C9=\"\",0,IF($S9<=VLOOKUP($C9,PREMISSAS!$C$6:$J$13,4,FALSE),$S9,VLOOKUP($C9,PREMISSAS!$C$6:$J$13,4,FALSE)))","v":0}]
[null,null,null,"DEPARTAMENTO","Escolha o departamento/setor de cada funcionário."]
[]
[null,null,null,"FOLHA PONTO"]
[null,null,null,"LANÇAMENTOS","Preenchimento do cartão ponto individual (Limite de 20 funcionários)"]
[]
[null,null,null,"LANÇAMENTOS","Nâo colocar os dois pontos, apenas o horario"]

{"sheet":"PERIODOS E FERIADOS","index":1,"n_rows":26,"n_cols":7,"rows_kept":26,"cut":false,"hidden":false,"merged":[[17,5,17,6],[19,5,19,6],[25,5,25,6],[20,5,20,6],[21,5,21,6],[22,5,22,6],[23,5,23,6],[24,5,24,6],[10,5,10,6],[11,5,11,6],[12,5,12,6],[13,5,13,6],[14,5,14,6],[4,4,4,6],[3,3,3,6],[7,3,7,6],[8,5,8,6],[9,5,9,6]]}
[]
[]
[]
[null,null,null,"DADOS DA EMPRESA"]
[null,null,null,"EMPRESA:"]
[null,null,2,"PERÍODO","2023-05-01","À",{"$f":"DATE(YEAR($E$6),MONTH($E$6)+1,DAY($E$6)-1)","v":"2023-05-31"}]
[null,null,3]
[null,null,4,"FERIADOS"]
[null,null,5,"2022-01-01",{"$f":"IF(D9=\"\",\"\",IF(WEEKDAY(D9,1)=1,\"Domingo\",IF(WEEKDAY(D9,1)=2,\"Segunda\",IF(WEEKDAY(D9,1)=3,\"Terça\",IF(WEEKDAY(D9,1)=4,\"Quarta\",IF(WEEKDAY(D9,1)=5,\"Quinta\",IF(WEEKDAY(D9,1)=6,\"Sexta\",IF(WEEKDAY(D9,1)=7,\"Sábado\"))))))))","v":"Sábado"},"Confraternização universal"]
[null,null,6,"2022-03-01","Terça","carnaval"]
[null,null,7,"2023-04-07","Sexta","Paixao de cristo"]
[null,null,1,"2023-04-21",{"$f":"IF(D12=\"\",\"\",IF(WEEKDAY(D12,1)=1,\"Domingo\",IF(WEEKDAY(D12,1)=2,\"Segunda\",IF(WEEKDAY(D12,1)=3,\"Terça\",IF(WEEKDAY(D12,1)=4,\"Quarta\",IF(WEEKDAY(D12,1)=5,\"Quinta\",IF(WEEKDAY(D12,1)=6,\"Sexta\",IF(WEEKDAY(D12,1)=7,\"Sábado\"))))))))","v":"Sexta"},"Tiradentes"]
[null,null,"F","2023-05-01","Segunda","Dia do trabalhador"]
[null,null,null,"2023-07-04",{"$f":"IF(D14=\"\",\"\",IF(WEEKDAY(D14,1)=1,\"Domingo\",IF(WEEKDAY(D14,1)=2,\"Segunda\",IF(WEEKDAY(D14,1)=3,\"Terça\",IF(WEEKDAY(D14,1)=4,\"Quarta\",IF(WEEKDAY(D14,1)=5,\"Quinta\",IF(WEEKDAY(D14,1)=6,\"Sexta\",IF(WEEKDAY(D14,1)=7,\"Sábado\"))))))))","v":"Terça"},"Aniversario cidade"]
[null,null,null,"2023-07-25","Terça","Padroeiro da Cidade"]
[null,null,null,"2023-09-07","Quinta","Indepedencia do Brasil"]
[null,null,null,"2023-10-12","Quinta","Nossa Sra. Aparecida"]
[null,null,null,"2023-11-02","Quinta","Finados"]
[null,null,null,"2023-11-15","Quarta","Proclamação da Republica"]
[null,null,null,"2023-12-25","Segunda","Natal"]
[null,null,null,null,""]
[null,null,null,null,""]
[null,null,null,null,""]
[null,null,null,null,""]
[null,null,null,null,""]
[null,null,null,null,""]

{"sheet":"PREMISSAS","index":2,"n_rows":15,"n_cols":8,"rows_kept":15,"cut":false,"hidden":false,"merged":[[16,3,16,6],[3,3,3,7],[4,4,4,7],[5,7,10,7],[11,7,12,7]]}
[]
[]
[]
[null,null,null,"HORA EXTRA"]
[null,null,null,"DIA DA SEMANA","CÁLCULO"]
[null,null,2,"SEGUNDA-FEIRA","AS",1,"PRIMEIRAS HORAS SERÃO",0.5]
[null,null,3,"TERÇA-FEIRA","AS",1,"PRIMEIRAS HORAS SERÃO"]
[null,null,4,"QUARTA-FEIRA","AS",1,"PRIMEIRAS HORAS SERÃO"]
[null,null,5,"QUINTA-FEIRA","AS",1,"PRIMEIRAS HORAS SERÃO"]
[null,null,6,"SEXTA-FEIRA","AS",1,"PRIMEIRAS HORAS SERÃO"]
[null,null,7,"SÁBADO","AS",1,"PRIMEIRAS HORAS SERÃO"]
[null,null,1,"DOMINGO","AS",0,"PRIMEIRAS HORAS SERÃO",1]
[null,null,"F","FERIADOS","AS",0,"PRIMEIRAS HORAS SERÃO"]
[]
[null,null,null,"TOLERANCIA","00:05:00","MINUTOS"]

{"sheet":"FUNCIONÁRIOS","index":3,"n_rows":24,"n_cols":5,"rows_kept":24,"cut":false,"hidden":false,"merged":[[21,4,21,7],[22,4,22,7],[23,4,23,7],[18,4,18,7],[19,4,19,7],[3,4,3,7],[4,4,4,7],[15,4,15,7],[16,4,16,7],[20,4,20,7],[17,4,17,7],[8,4,8,7],[9,4,9,7],[10,4,10,7],[11,4,11,7],[12,4,12,7],[13,4,13,7],[14,4,14,7],[5,4,5,7],[6,4,6,7],[7,4,7,7]]}
[]
[]
[]
[null,null,null,"CELULA","CADASTRO DE FUNCIONÁRIO - NOME COMPLETO"]
[null,null,null,"FUNC 1",1]
[null,null,null,"FUNC 2",2]
[null,null,null,"FUNC 3",3]
[null,null,null,"FUNC 4",4]
[null,null,null,"FUNC 5",5]
[null,null,null,"FUNC 6",6]
[null,null,null,"FUNC 7",7]
[null,null,null,"FUNC 8",8]
[null,null,null,"FUNC 9",9]
[null,null,null,"FUNC 10",10]
[null,null,null,"FUNC 11",11]
[null,null,null,"FUNC 12",12]
[null,null,null,"FUNC 13",13]
[null,null,null,"FUNC 14",14]
[null,null,null,"FUNC 15",15]
[null,null,null,"FUNC 16",16]
[null,null,null,"FUNC 17",17]
[null,null,null,"FUNC 18",18]
[null,null,null,"FUNC 19",19]
[null,null,null,"FUNC 20",20]

{"sheet":"PLAN MOD","index":4,"n_rows":43,"n_cols":37,"rows_kept":43,"cut":false,"hidden":true,"merged":[[3,3,4,27],[5,3,5,4],[5,5,5,10],[5,12,5,20],[5,22,5,24],[5,26,5,27],[5,30,5,33],[40,3,40,5],[40,6,40,7],[40,8,40,10],[42,3,43,24]]}
["EspExcel"]
[]
[]
[null,null,null,{"$f":"'PERIODOS E FERIADOS'!$E$5","v":0}]
[]
[null,null,null,"Funcionário",null,{"$f":"FUNCIONÁRIOS!E5","v":1},null,null,null,null,null,null,"H.E. / Atrasos / A.N",null,null,null,null,null,null,null,null,null,"Distrib. H.E. p/ Faixa",null,null,null,"CARGA HORÁRIA",null,null,null,"ESPELHO"]
[]
[null,null,null,"Data","Dia Semana","Entrada","Saída","Entrada","Saída","Entrada","Saída",null,"H. Diária",null,"Atrasos",null,"Abona",null,"Horas Extras",null,"Adc. Noturno",null,"1ª Faixa",null,"2ª Faixa",2,"SEGUNDA",0.33333333333333331,2,null,"Entrada","Saída","Entrada","Saída","Entrada","Saída","AN "]
[null,null,{"$f":"IF(NOT(ISERROR(VLOOKUP(D9,rngFeriados,1,FALSE))),\"F\",IF(D9=\"\",\"\",WEEKDAY($D9,1)))","v":"F"},{"$f":"'PERIODOS E FERIADOS'!$E$6","v":"2023-05-01"},{"$f":"IF(D9=\"\",\"\",IF(WEEKDAY(D9,1)=1,\"Domingo\",IF(WEEKDAY(D9,1)=2,\"Segunda\",IF(WEEKDAY(D9,1)=3,\"Terça\",IF(WEEKDAY(D9,1)=4,\"Quarta\",IF(WEEKDAY(D9,1)=5,\"Quinta\",IF(WEEKDAY(D9,1)=6,\"Sexta\",IF(WEEKDAY(D9,1)=7,\"Sábado\"))))))))","v":"Segunda"},800,1200,1400,1700,null,null,null,{"$f":"IF(ISERROR(IF(OR($AF9=\"\",$AF9=0),0,(IF(TEXT($AF9,\"[hh]:mm:ss\")<TEXT($AE9,\"[hh]:mm:ss\"),(1-$AE9+$AF9),$AF9-$AE9))+IF(OR($AH9=\"\",$AH9=0),0,(IF(TEXT($AH9,\"[hh]:mm:ss\")<TEXT($AG9,\"[hh]:mm:ss\"),(1-$AG9+$AH9),$AH9-$AG9))+IF(OR($AJ9=\"\",$AJ9=0),0,(IF(TEXT($AJ9,\"[hh]:mm:ss\")<TEXT($AI9,\"[hh]:mm:ss\"),(1-$AI9+$AJ9),$AJ9-$AI9)))))),0,IF(OR($AF9=\"\",$AF9=0),0,(IF(TEXT($AF9,\"[hh]:mm:ss\")<TEXT($AE9,\"[hh]:mm:ss\"),(1-$AE9+$AF9),$AF9-$AE9))+IF(OR($AH9=\"\",$AH9=0),0,(IF(TEXT($AH9,\"[hh]:mm:ss\")<TEXT($AG9,\"[hh]:mm:ss\"),(1-$AG9+$AH9),$AH9-$AG9))+IF(OR($AJ9=\"\",$AJ9=0),0,(IF(TEXT($AJ9,\"[hh]:mm:ss\")<TEXT($AI9,\"[hh]:mm:ss\"),(1-$AI9+$AJ9),$AJ9-$AI9))))))","v":0.29166666666666669},null,{"$f":"IF($C9=\"\",0,IF(Q9=\"Sim\",0,IF(TEXT(IF(OR((VLOOKUP($C9,$Z$8:$AB$15,3,FALSE)-$M9)<0,$AE9=\"\"),0,(VLOOKUP($C9,$Z$8:$AB$15,3,FALSE)-$M9)),\"[hh]:mm\")<=TEXT(rngTolerancia,\"[hh]:mm\"),0,IF(OR((VLOOKUP($C9,$Z$8:$AB$15,3,FALSE)-$M9)<0,$AE9=\"\"),0,(VLOOKUP($C9,$Z$8:$AB$15,3,FALSE)-$M9)))))","v":0},null,null,null,{"$f":"IF($C9=\"\",0,IF(TEXT(IF(($M9-VLOOKUP($C9,$Z$8:$AB$15,3,FALSE))<0,0,($M9-VLOOKUP($C9,$Z$8:$AB$15,3,FALSE))),\"[hh]:mm\")<=TEXT(rngTolerancia,\"[hh]:mm\"),0,IF(($M9-VLOOKUP($C9,$Z$8:$AB$15,3,FALSE))<0,0,($M9-VLOOKUP($C9,$Z$8:$AB$15,3,FALSE)))))","v":0.29166666666666669},null,null,null,{"$f":"IF($C9=\"\",0,IF($S9<=VLOOKUP($C9,PREMISSAS!$C$6:$J$13,4,FALSE),$S9,VLOOKUP($C9,PREMISSAS!$C$6:$J$13,4,FALSE)))","v":0},null,{"$f":"IF($C9=\"\",0,IF($S9>VLOOKUP($C9,PREMISSAS!$C$6:$J$13,4,FALSE),$S9-VLOOKUP($C9,PREMISSAS!$C$6:$J$13,4,FALSE),0))","v":0.29166666666666669},3,"TERÇA",0.33333333333333331,3,null,{"$f":"IF(OR(F9=\"\",F9=0,F9=\"FALTA\",F9=\"SUSPENSO\",F9=\"SUSPENSÃO\"),\"\",TEXT(F9,\"##\"\":\"\"##\"))","v":"8:00"},{"$f":"IF(OR(G9=\"\",G9=0,G9=\"FALTA\",G9=\"SUSPENSO\",G9=\"SUSPENSÃO\"),\"\",TEXT(G9,\"##\"\":\"\"##\"))","v":"12:00"},"14:00","17:00",{"$f":"IF(OR(J9=\"\",J9=0,J9=\"FALTA\",J9=\"SUSPENSO\",J9=\"SUSPENSÃO\"),\"\",TEXT(J9,\"##\"\":\"\"##\"))","v":""},{"$f":"IF(OR(K9=\"\",K9=0,K9=\"FALTA\",K9=\"SUSPENSO\",K9=\"SUSPENSÃO\"),\"\",TEXT(K9,\"##\"\":\"\"##\"))","v":""},{"$f":"IF(OR(U9=\"\",U9=0,U9=\"FALTA\",U9=\"SUSPENSO\",U9=\"SUSPENSÃO\"),\"\",TEXT(TEXT(U9,\"00\"\":\"\"00\"),\"[hh]:mm\")*1)","v":""}]
[null,null,3,{"$f":"IF(D9=\"\",\"\",IF((D9+1)>'PERIODOS E FERIADOS'!$G$6,\"\",D9+1))","v":"2023-05-02"},{"$f":"IF(D10=\"\",\"\",IF(WEEKDAY(D10,1)=1,\"Domingo\",IF(WEEKDAY(D10,1)=2,\"Segunda\",IF(WEEKDAY(D10,1)=3,\"Terça\",IF(WEEKDAY(D10,1)=4,\"Quarta\",IF(WEEKDAY(D10,1)=5,\"Quinta\",IF(WEEKDAY(D10,1)=6,\"Sexta\",IF(WEEKDAY(D10,1)=7,\"Sábado\"))))))))","v":"Terça"},800,1200,1400,1700,null,null,null,{"$f":"IF(ISERROR(IF(OR($AF10=\"\",$AF10=0),0,(IF(TEXT($AF10,\"[hh]:mm:ss\")<TEXT($AE10,\"[hh]:mm:ss\"),(1-$AE10+$AF10),$AF10-$AE10))+IF(OR($AH10=\"\",$AH10=0),0,(IF(TEXT($AH10,\"[hh]:mm:ss\")<TEXT($AG10,\"[hh]:mm:ss\"),(1-$AG10+$AH10),$AH10-$AG10))+IF(OR($AJ10=\"\",$AJ10=0),0,(IF(TEXT($AJ10,\"[hh]:mm:ss\")<TEXT($AI10,\"[hh]:mm:ss\"),(1-$AI10+$AJ10),$AJ10-$AI10)))))),0,IF(OR($AF10=\"\",$AF10=0),0,(IF(TEXT($AF10,\"[hh]:mm:ss\")<TEXT($AE10,\"[hh]:mm:ss\"),(1-$AE10+$AF10),$AF10-$AE10))+IF(OR($AH10=\"\",$AH10=0),0,(IF(TEXT($AH10,\"[hh]:mm:ss\")<TEXT($AG10,\"[hh]:mm:ss\"),(1-$AG10+$AH10),$AH10-$AG10))+IF(OR($AJ10=\"\",$AJ10=0),0,(IF(TEXT($AJ10,\"[hh]:mm:ss\")<TEXT($AI10,\"[hh]:mm:ss\"),(1-$AI10+$AJ10),$AJ10-$AI10))))))","v":0.29166666666666669},null,{"$f":"IF($C10=\"\",0,IF(Q10=\"Sim\",0,IF(TEXT(IF(OR((VLOOKUP($C10,$Z$8:$AB$15,3,FALSE)-$M10)<0,$AE10=\"\"),0,(VLOOKUP($C10,$Z$8:$AB$15,3,FALSE)-$M10)),\"[hh]:mm\")<=TEXT(rngTolerancia,\"[hh]:mm\"),0,IF(OR((VLOOKUP($C10,$Z$8:$AB$15,3,FALSE)-$M10)<0,$AE10=\"\"),0,(VLOOKUP($C10,$Z$8:$AB$15,3,FALSE)-$M10)))))","v":4.166666666666663E-2},null,null,null,0,null,null,null,{"$f":"IF($C10=\"\",0,IF($S10<=VLOOKUP($C10,PREMISSAS!$C$6:$J$13,4,FALSE),$S10,VLOOKUP($C10,PREMISSAS!$C$6:$J$13,4,FALSE)))","v":0},null,{"$f":"IF($C10=\"\",0,IF($S10>VLOOKUP($C10,PREMISSAS!$C$6:$J$13,4,FALSE),$S10-VLOOKUP($C10,PREMISSAS!$C$6:$J$13,4,FALSE),0))","v":0},4,"QUARTA",0.33333333333333331,4,null,{"$f":"IF(OR(F10=\"\",F10=0,F10=\"FALTA\",F10=\"SUSPENSO\",F10=\"SUSPENSÃO\"),\"\",TEXT(F10,\"##\"\":\"\"##\"))","v":"8:00"},"12:00","14:00","17:00","","",{"$f":"IF(OR(U10=\"\",U10=0,U10=\"FALTA\",U10=\"SUSPENSO\",U10=\"SUSPENSÃO\"),\"\",TEXT(TEXT(U10,\"00\"\":\"\"00\"),\"[hh]:mm\")*1)","v":""}]
[null,null,4,{"$f":"IF(D10=\"\",\"\",IF((D10+1)>'PERIODOS E FERIADOS'!$G$6,\"\",D10+1))","v":"2023-05-03"},"Quarta",800,1200,1400,1700,null,null,null,0.29166666666666669,null,4.166666666666663E-2,null,null,null,0,null,null,null,{"$f":"IF($C11=\"\",0,IF($S11<=VLOOKUP($C11,PREMISSAS!$C$6:$J$13,4,FALSE),$S11,VLOOKUP($C11,PREMISSAS!$C$6:$J$13,4,FALSE)))","v":0},null,{"$f":"IF($C11=\"\",0,IF($S11>VLOOKUP($C11,PREMISSAS!$C$6:$J$13,4,FALSE),$S11-VLOOKUP($C11,PREMISSAS!$C$6:$J$13,4,FALSE),0))","v":0},5,"QUINTA",0.33333333333333331,5,null,"8:00","12:00","14:00","17:00","","",""]
[null,null,5,{"$f":"IF(D11=\"\",\"\",IF((D11+1)>'PERIODOS E FERIADOS'!$G$6,\"\",D11+1))","v":"2023-05-04"},"Quinta",800,1200,1400,1700,null,null,null,0.29166666666666669,null,4.166666666666663E-2,null,null,null,0,null,null,null,{"$f":"IF($C12=\"\",0,IF($S12<=VLOOKUP($C12,PREMISSAS!$C$6:$J$13,4,FALSE),$S12,VLOOKUP($C12,PREMISSAS!$C$6:$J$13,4,FALSE)))","v":0},null,{"$f":"IF($C12=\"\",0,IF($S12>VLOOKUP($C12,PREMISSAS!$C$6:$J$13,4,FALSE),$S12-VLOOKUP($C12,PREMISSAS!$C$6:$J$13,4,FALSE),0))","v":0},6,"SEXTA",0.33333333333333331,6,null,"8:00","12:00","14:00","17:00","","",{"$f":"IF(OR(U12=\"\",U12=0,U12=\"FALTA\",U12=\"SUSPENSO\",U12=\"SUSPENSÃO\"),\"\",TEXT(TEXT(U12,\"##\"\":\"\"##\"),\"[hh]:mm\")*1)","v":""}]
[null,null,6,{"$f":"IF(D12=\"\",\"\",IF((D12+1)>'PERIODOS E FERIADOS'!$G$6,\"\",D12+1))","v":"2023-05-05"},"Sexta",800,1200,1400,1700,null,null,null,0.29166666666666669,null,4.166666666666663E-2,null,null,null,0,null,null,null,{"$f":"IF($C13=\"\",0,IF($S13<=VLOOKUP($C13,PREMISSAS!$C$6:$J$13,4,FALSE),$S13,VLOOKUP($C13,PREMISSAS!$C$6:$J$13,4,FALSE)))","v":0},null,{"$f":"IF($C13=\"\",0,IF($S13>VLOOKUP($C13,PREMISSAS!$C$6:$J$13,4,FALSE),$S13-VLOOKUP($C13,PREMISSAS!$C$6:$J$13,4,FALSE),0))","v":0},7,"SÁBADO",0,7,null,"8:00","12:00","14:00","17:00","","",""]
[null,null,7,{"$f":"IF(D13=\"\",\"\",IF((D13+1)>'PERIODOS E FERIADOS'!$G$6,\"\",D13+1))","v":"2023-05-06"},"Sábado",800,1200,1400,1700,null,null,null,0.29166666666666669,null,0,null,null,null,0.29166666666666669,null,null,null,{"$f":"IF($C14=\"\",0,IF($S14<=VLOOKUP($C14,PREMISSAS!$C$6:$J$13,4,FALSE),$S14,VLOOKUP($C14,PREMISSAS!$C$6:$J$13,4,FALSE)))","v":0.29166666666666669},null,{"$f":"IF($C14=\"\",0,IF($S14>VLOOKUP($C14,PREMISSAS!$C$6:$J$13,4,FALSE),$S14-VLOOKUP($C14,PREMISSAS!$C$6:$J$13,4,FALSE),0))","v":0},1,"DOMINGO",0,1,null,"8:00","12:00","14:00","17:00","","",""]
[null,null,1,{"$f":"IF(D14=\"\",\"\",IF((D14+1)>'PERIODOS E FERIADOS'!$G$6,\"\",D14+1))","v":"2023-05-07"},"Domingo",800,1200,1400,1700,null,null,null,0.29166666666666669,null,0,null,null,null,0.29166666666666669,null,null,null,{"$f":"IF($C15=\"\",0,IF($S15<=VLOOKUP($C15,PREMISSAS!$C$6:$J$13,4,FALSE),$S15,VLOOKUP($C15,PREMISSAS!$C$6:$J$13,4,FALSE)))","v":0},null,{"$f":"IF($C15=\"\",0,IF($S15>VLOOKUP($C15,PREMISSAS!$C$6:$J$13,4,FALSE),$S15-VLOOKUP($C15,PREMISSAS!$C$6:$J$13,4,FALSE),0))","v":0.29166666666666669},"F","FERIADOS",0,"F",null,"8:00","12:00","14:00","17:00","","",""]
[null,null,2,{"$f":"IF(D15=\"\",\"\",IF((D15+1)>'PERIODOS E FERIADOS'!$G$6,\"\",D15+1))","v":"2023-05-08"},"Segunda",800,1200,1400,1700,null,null,null,0.29166666666666669,null,4.166666666666663E-2,null,null,null,0,null,null,null,{"$f":"IF($C16=\"\",0,IF($S16<=VLOOKUP($C16,PREMISSAS!$C$6:$J$13,4,FALSE),$S16,VLOOKUP($C16,PREMISSAS!$C$6:$J$13,4,FALSE)))","v":0},null,{"$f":"IF($C16=\"\",0,IF($S16>VLOOKUP($C16,PREMISSAS!$C$6:$J$13,4,FALSE),$S16-VLOOKUP($C16,PREMISSAS!$C$6:$J$13,4,FALSE),0))","v":0},null,null,null,null,null,"8:00","12:00","14:00","17:00","","",""]
[null,null,3,{"$f":"IF(D16=\"\",\"\",IF((D16+1)>'PERIODOS E FERIADOS'!$G$6,\"\",D16+1))","v":"2023-05-09"},"Terça",800,1200,1400,1700,null,null,null,0.29166666666666669,null,4.166666666666663E-2,null,null,null,0,null,null,null,{"$f":"IF($C17=\"\",0,IF($S17<=VLOOKUP($C17,PREMISSAS!$C$6:$J$13,4,FALSE),$S17,VLOOKUP($C17,PREMISSAS!$C$6:$J$13,4,FALSE)))","v":0},null,{"$f":"IF($C17=\"\",0,IF($S17>VLOOKUP($C17,PREMISSAS!$C$6:$J$13,4,FALSE),$S17-VLOOKUP($C17,PREMISSAS!$C$6:$J$13,4,FALSE),0))","v":0},null,null,null,null,null,"8:00","12:00","14:00","17:00","","",""]
[null,null,4,{"$f":"IF(D17=\"\",\"\",IF((D17+1)>'PERIODOS E FERIADOS'!$G$6,\"\",D17+1))","v":"2023-05-10"},"Quarta",800,1200,1400,1700,null,null,null,0.29166666666666669,null,4.166666666666663E-2,null,null,null,0,null,null,null,{"$f":"IF($C18=\"\",0,IF($S18<=VLOOKUP($C18,PREMISSAS!$C$6:$J$13,4,FALSE),$S18,VLOOKUP($C18,PREMISSAS!$C$6:$J$13,4,FALSE)))","v":0},null,{"$f":"IF($C18=\"\",0,IF($S18>VLOOKUP($C18,PREMISSAS!$C$6:$J$13,4,FALSE),$S18-VLOOKUP($C18,PREMISSAS!$C$6:$J$13,4,FALSE),0))","v":0},null,null,null,null,null,"8:00","12:00","14:00","17:00","","",""]
[null,null,5,{"$f":"IF(D18=\"\",\"\",IF((D18+1)>'PERIODOS E FERIADOS'!$G$6,\"\",D18+1))","v":"2023-05-11"},"Quinta",800,1200,1400,1700,null,null,null,0.29166666666666669,null,4.166666666666663E-2,null,null,null,0,null,null,null,{"$f":"IF($C19=\"\",0,IF($S19<=VLOOKUP($C19,PREMISSAS!$C$6:$J$13,4,FALSE),$S19,VLOOKUP($C19,PREMISSAS!$C$6:$J$13,4,FALSE)))","v":0},null,{"$f":"IF($C19=\"\",0,IF($S19>VLOOKUP($C19,PREMISSAS!$C$6:$J$13,4,FALSE),$S19-VLOOKUP($C19,PREMISSAS!$C$6:$J$13,4,FALSE),0))","v":0},null,null,null,null,null,"8:00","12:00","14:00","17:00","","",""]
[null,null,6,{"$f":"IF(D19=\"\",\"\",IF((D19+1)>'PERIODOS E FERIADOS'!$G$6,\"\",D19+1))","v":"2023-05-12"},"Sexta",800,1200,1400,1700,null,null,null,0.29166666666666669,null,4.166666666666663E-2,null,null,null,0,null,null,null,{"$f":"IF($C20=\"\",0,IF($S20<=VLOOKUP($C20,PREMISSAS!$C$6:$J$13,4,FALSE),$S20,VLOOKUP($C20,PREMISSAS!$C$6:$J$13,4,FALSE)))","v":0},null,{"$f":"IF($C20=\"\",0,IF($S20>VLOOKUP($C20,PREMISSAS!$C$6:$J$13,4,FALSE),$S20-VLOOKUP($C20,PREMISSAS!$C$6:$J$13,4,FALSE),0))","v":0},null,null,null,null,null,"8:00","12:00","14:00","17:00","","",""]
[null,null,7,{"$f":"IF(D20=\"\",\"\",IF((D20+1)>'PERIODOS E FERIADOS'!$G$6,\"\",D20+1))","v":"2023-05-13"},"Sábado",800,1200,1400,1700,null,null,null,0.29166666666666669,null,0,null,null,null,0.29166666666666669,null,null,null,{"$f":"IF($C21=\"\",0,IF($S21<=VLOOKUP($C21,PREMISSAS!$C$6:$J$13,4,FALSE),$S21,VLOOKUP($C21,PREMISSAS!$C$6:$J$13,4,FALSE)))","v":0.29166666666666669},null,{"$f":"IF($C21=\"\",0,IF($S21>VLOOKUP($C21,PREMISSAS!$C$6:$J$13,4,FALSE),$S21-VLOOKUP($C21,PREMISSAS!$C$6:$J$13,4,FALSE),0))","v":0},null,null,null,null,null,"8:00","12:00","14:00","17:00","","",""]
[null,null,1,{"$f":"IF(D21=\"\",\"\",IF((D21+1)>'PERIODOS E FERIADOS'!$G$6,\"\",D21+1))","v":"2023-05-14"},"Domingo",800,1200,1400,1700,null,null,null,0.29166666666666669,null,0,null,null,null,0.29166666666666669,null,null,null,{"$f":"IF($C22=\"\",0,IF($S22<=VLOOKUP($C22,PREMISSAS!$C$6:$J$13,4,FALSE),$S22,VLOOKUP($C22,PREMISSAS!$C$6:$J$13,4,FALSE)))","v":0},null,{"$f":"IF($C22=\"\",0,IF($S22>VLOOKUP($C22,PREMISSAS!$C$6:$J$13,4,FALSE),$S22-VLOOKUP($C22,PREMISSAS!$C$6:$J$13,4,FALSE),0))","v":0.29166666666666669},null,null,null,null,null,"8:00","12:00","14:00","17:00","","",""]
[null,null,2,{"$f":"IF(D22=\"\",\"\",IF((D22+1)>'PERIODOS E FERIADOS'!$G$6,\"\",D22+1))","v":"2023-05-15"},"Segunda",800,1200,1400,1700,null,null,null,0.29166666666666669,null,4.166666666666663E-2,null,null,null,0,null,null,null,{"$f":"IF($C23=\"\",0,IF($S23<=VLOOKUP($C23,PREMISSAS!$C$6:$J$13,4,FALSE),$S23,VLOOKUP($C23,PREMISSAS!$C$6:$J$13,4,FALSE)))","v":0},null,{"$f":"IF($C23=\"\",0,IF($S23>VLOOKUP($C23,PREMISSAS!$C$6:$J$13,4,FALSE),$S23-VLOOKUP($C23,PREMISSAS!$C$6:$J$13,4,FALSE),0))","v":0},null,null,null,null,null,"8:00","12:00","14:00","17:00","","",""]
[null,null,3,{"$f":"IF(D23=\"\",\"\",IF((D23+1)>'PERIODOS E FERIADOS'!$G$6,\"\",D23+1))","v":"2023-05-16"},"Terça","FALTA",null,null,null,null,null,null,0,null,0,null,null,null,0,null,null,null,{"$f":"IF($C24=\"\",0,IF($S24<=VLOOKUP($C24,PREMISSAS!$C$6:$J$13,4,FALSE),$S24,VLOOKUP($C24,PREMISSAS!$C$6:$J$13,4,FALSE)))","v":0},null,{"$f":"IF($C24=\"\",0,IF($S24>VLOOKUP($C24,PREMISSAS!$C$6:$J$13,4,FALSE),$S24-VLOOKUP($C24,PREMISSAS!$C$6:$J$13,4,FALSE),0))","v":0},null,null,null,null,null,"","","","","","",""]
[null,null,4,{"$f":"IF(D24=\"\",\"\",IF((D24+1)>'PERIODOS E FERIADOS'!$G$6,\"\",D24+1))","v":"2023-05-17"},"Quarta",800,1200,1400,1700,null,null,null,0.29166666666666669,null,4.166666666666663E-2,null,null,null,0,null,null,null,{"$f":"IF($C25=\"\",0,IF($S25<=VLOOKUP($C25,PREMISSAS!$C$6:$J$13,4,FALSE),$S25,VLOOKUP($C25,PREMISSAS!$C$6:$J$13,4,FALSE)))","v":0},null,{"$f":"IF($C25=\"\",0,IF($S25>VLOOKUP($C25,PREMISSAS!$C$6:$J$13,4,FALSE),$S25-VLOOKUP($C25,PREMISSAS!$C$6:$J$13,4,FALSE),0))","v":0},null,null,null,null,null,"8:00","12:00","14:00","17:00","","",""]
[null,null,5,{"$f":"IF(D25=\"\",\"\",IF((D25+1)>'PERIODOS E FERIADOS'!$G$6,\"\",D25+1))","v":"2023-05-18"},"Quinta","FALTA",null,null,null,null,null,null,0,null,0,null,null,null,0,null,null,null,{"$f":"IF($C26=\"\",0,IF($S26<=VLOOKUP($C26,PREMISSAS!$C$6:$J$13,4,FALSE),$S26,VLOOKUP($C26,PREMISSAS!$C$6:$J$13,4,FALSE)))","v":0},null,{"$f":"IF($C26=\"\",0,IF($S26>VLOOKUP($C26,PREMISSAS!$C$6:$J$13,4,FALSE),$S26-VLOOKUP($C26,PREMISSAS!$C$6:$J$13,4,FALSE),0))","v":0},null,null,null,null,null,"","","","","","",""]
[null,null,6,{"$f":"IF(D26=\"\",\"\",IF((D26+1)>'PERIODOS E FERIADOS'!$G$6,\"\",D26+1))","v":"2023-05-19"},"Sexta",800,1200,1400,1700,null,null,null,0.29166666666666669,null,4.166666666666663E-2,null,null,null,0,null,null,null,{"$f":"IF($C27=\"\",0,IF($S27<=VLOOKUP($C27,PREMISSAS!$C$6:$J$13,4,FALSE),$S27,VLOOKUP($C27,PREMISSAS!$C$6:$J$13,4,FALSE)))","v":0},null,{"$f":"IF($C27=\"\",0,IF($S27>VLOOKUP($C27,PREMISSAS!$C$6:$J$13,4,FALSE),$S27-VLOOKUP($C27,PREMISSAS!$C$6:$J$13,4,FALSE),0))","v":0},null,null,null,null,null,"8:00","12:00","14:00","17:00","","",""]
[null,null,7,{"$f":"IF(D27=\"\",\"\",IF((D27+1)>'PERIODOS E FERIADOS'!$G$6,\"\",D27+1))","v":"2023-05-20"},"Sábado",800,1200,1400,1700,null,null,null,0.29166666666666669,null,0,null,null,null,0.29166666666666669,null,null,null,{"$f":"IF($C28=\"\",0,IF($S28<=VLOOKUP($C28,PREMISSAS!$C$6:$J$13,4,FALSE),$S28,VLOOKUP($C28,PREMISSAS!$C$6:$J$13,4,FALSE)))","v":0.29166666666666669},null,{"$f":"IF($C28=\"\",0,IF($S28>VLOOKUP($C28,PREMISSAS!$C$6:$J$13,4,FALSE),$S28-VLOOKUP($C28,PREMISSAS!$C$6:$J$13,4,FALSE),0))","v":0},null,null,null,null,null,"8:00","12:00","14:00","17:00","","",""]
[null,null,1,{"$f":"IF(D28=\"\",\"\",IF((D28+1)>'PERIODOS E FERIADOS'!$G$6,\"\",D28+1))","v":"2023-05-21"},"Domingo",800,1200,1400,1700,null,null,null,0.29166666666666669,null,0,null,null,null,0.29166666666666669,null,null,null,{"$f":"IF($C29=\"\",0,IF($S29<=VLOOKUP($C29,PREMISSAS!$C$6:$J$13,4,FALSE),$S29,VLOOKUP($C29,PREMISSAS!$C$6:$J$13,4,FALSE)))","v":0},null,{"$f":"IF($C29=\"\",0,IF($S29>VLOOKUP($C29,PREMISSAS!$C$6:$J$13,4,FALSE),$S29-VLOOKUP($C29,PREMISSAS!$C$6:$J$13,4,FALSE),0))","v":0.29166666666666669},null,null,null,null,null,"8:00","12:00","14:00","17:00","","",""]
[null,null,2,{"$f":"IF(D29=\"\",\"\",IF((D29+1)>'PERIODOS E FERIADOS'!$G$6,\"\",D29+1))","v":"2023-05-22"},"Segunda",800,1200,1400,1700,null,null,null,0.29166666666666669,null,4.166666666666663E-2,null,null,null,0,null,null,null,{"$f":"IF($C30=\"\",0,IF($S30<=VLOOKUP($C30,PREMISSAS!$C$6:$J$13,4,FALSE),$S30,VLOOKUP($C30,PREMISSAS!$C$6:$J$13,4,FALSE)))","v":0},null,{"$f":"IF($C30=\"\",0,IF($S30>VLOOKUP($C30,PREMISSAS!$C$6:$J$13,4,FALSE),$S30-VLOOKUP($C30,PREMISSAS!$C$6:$J$13,4,FALSE),0))","v":0},null,null,null,null,null,"8:00","12:00","14:00","17:00","","",""]
[null,null,3,{"$f":"IF(D30=\"\",\"\",IF((D30+1)>'PERIODOS E FERIADOS'!$G$6,\"\",D30+1))","v":"2023-05-23"},"Terça",800,1200,1400,1700,null,null,null,0.29166666666666669,null,4.166666666666663E-2,null,null,null,0,null,null,null,{"$f":"IF($C31=\"\",0,IF($S31<=VLOOKUP($C31,PREMISSAS!$C$6:$J$13,4,FALSE),$S31,VLOOKUP($C31,PREMISSAS!$C$6:$J$13,4,FALSE)))","v":0},null,{"$f":"IF($C31=\"\",0,IF($S31>VLOOKUP($C31,PREMISSAS!$C$6:$J$13,4,FALSE),$S31-VLOOKUP($C31,PREMISSAS!$C$6:$J$13,4,FALSE),0))","v":0},null,null,null,null,null,"8:00","12:00","14:00","17:00","","",""]
[null,null,4,{"$f":"IF(D31=\"\",\"\",IF((D31+1)>'PERIODOS E FERIADOS'!$G$6,\"\",D31+1))","v":"2023-05-24"},"Quarta",800,1200,1400,1700,null,null,null,0.29166666666666669,null,4.166666666666663E-2,null,null,null,0,null,null,null,{"$f":"IF($C32=\"\",0,IF($S32<=VLOOKUP($C32,PREMISSAS!$C$6:$J$13,4,FALSE),$S32,VLOOKUP($C32,PREMISSAS!$C$6:$J$13,4,FALSE)))","v":0},null,{"$f":"IF($C32=\"\",0,IF($S32>VLOOKUP($C32,PREMISSAS!$C$6:$J$13,4,FALSE),$S32-VLOOKUP($C32,PREMISSAS!$C$6:$J$13,4,FALSE),0))","v":0},null,null,null,null,null,{"$f":"IF(OR(F32=\"\",F32=0,F32=\"FALTA\",F32=\"SUSPENSO\",F32=\"SUSPENSÃO\"),\"\",TEXT(F32,\"##\"\":\"\"##\"))","v":"8:00"},{"$f":"IF(OR(G32=\"\",G32=0,G32=\"FALTA\",G32=\"SUSPENSO\",G32=\"SUSPENSÃO\"),\"\",TEXT(G32,\"##\"\":\"\"##\"))","v":"12:00"},"14:00","17:00",{"$f":"IF(OR(J32=\"\",J32=0,J32=\"FALTA\",J32=\"SUSPENSO\",J32=\"SUSPENSÃO\"),\"\",TEXT(J32,\"##\"\":\"\"##\"))","v":""},{"$f":"IF(OR(K32=\"\",K32=0,K32=\"FALTA\",K32=\"SUSPENSO\",K32=\"SUSPENSÃO\"),\"\",TEXT(K32,\"##\"\":\"\"##\"))","v":""},""]
[null,null,5,{"$f":"IF(D32=\"\",\"\",IF((D32+1)>'PERIODOS E FERIADOS'!$G$6,\"\",D32+1))","v":"2023-05-25"},"Quinta",800,1200,1400,1700,null,null,null,0.29166666666666669,null,4.166666666666663E-2,null,null,null,0,null,null,null,{"$f":"IF($C33=\"\",0,IF($S33<=VLOOKUP($C33,PREMISSAS!$C$6:$J$13,4,FALSE),$S33,VLOOKUP($C33,PREMISSAS!$C$6:$J$13,4,FALSE)))","v":0},null,{"$f":"IF($C33=\"\",0,IF($S33>VLOOKUP($C33,PREMISSAS!$C$6:$J$13,4,FALSE),$S33-VLOOKUP($C33,PREMISSAS!$C$6:$J$13,4,FALSE),0))","v":0},null,null,null,null,null,{"$f":"IF(OR(F33=\"\",F33=0,F33=\"FALTA\",F33=\"SUSPENSO\",F33=\"SUSPENSÃO\"),\"\",TEXT(F33,\"##\"\":\"\"##\"))","v":"8:00"},"12:00","14:00","17:00","","",""]
[null,null,6,{"$f":"IF(D33=\"\",\"\",IF((D33+1)>'PERIODOS E FERIADOS'!$G$6,\"\",D33+1))","v":"2023-05-26"},"Sexta",800,1200,1400,1700,null,null,null,0.29166666666666669,null,4.166666666666663E-2,null,null,null,0,null,null,null,{"$f":"IF($C34=\"\",0,IF($S34<=VLOOKUP($C34,PREMISSAS!$C$6:$J$13,4,FALSE),$S34,VLOOKUP($C34,PREMISSAS!$C$6:$J$13,4,FALSE)))","v":0},null,{"$f":"IF($C34=\"\",0,IF($S34>VLOOKUP($C34,PREMISSAS!$C$6:$J$13,4,FALSE),$S34-VLOOKUP($C34,PREMISSAS!$C$6:$J$13,4,FALSE),0))","v":0},null,null,null,null,null,"8:00","12:00","14:00","17:00","","",""]
[null,null,7,{"$f":"IF(D34=\"\",\"\",IF((D34+1)>'PERIODOS E FERIADOS'!$G$6,\"\",D34+1))","v":"2023-05-27"},"Sábado",800,1200,1400,1700,null,null,null,0.29166666666666669,null,0,null,null,null,0.29166666666666669,null,null,null,{"$f":"IF($C35=\"\",0,IF($S35<=VLOOKUP($C35,PREMISSAS!$C$6:$J$13,4,FALSE),$S35,VLOOKUP($C35,PREMISSAS!$C$6:$J$13,4,FALSE)))","v":0.29166666666666669},null,{"$f":"IF($C35=\"\",0,IF($S35>VLOOKUP($C35,PREMISSAS!$C$6:$J$13,4,FALSE),$S35-VLOOKUP($C35,PREMISSAS!$C$6:$J$13,4,FALSE),0))","v":0},null,null,null,null,null,"8:00","12:00","14:00","17:00","","",""]
[null,null,1,{"$f":"IF(D35=\"\",\"\",IF((D35+1)>'PERIODOS E FERIADOS'!$G$6,\"\",D35+1))","v":"2023-05-28"},"Domingo",800,1200,1400,1700,null,null,null,0.29166666666666669,null,0,null,null,null,0.29166666666666669,null,null,null,{"$f":"IF($C36=\"\",0,IF($S36<=VLOOKUP($C36,PREMISSAS!$C$6:$J$13,4,FALSE),$S36,VLOOKUP($C36,PREMISSAS!$C$6:$J$13,4,FALSE)))","v":0},null,{"$f":"IF($C36=\"\",0,IF($S36>VLOOKUP($C36,PREMISSAS!$C$6:$J$13,4,FALSE),$S36-VLOOKUP($C36,PREMISSAS!$C$6:$J$13,4,FALSE),0))","v":0.29166666666666669},null,null,null,null,null,"8:00","12:00","14:00","17:00","","",""]
[null,null,2,{"$f":"IF(D36=\"\",\"\",IF((D36+1)>'PERIODOS E FERIADOS'!$G$6,\"\",D36+1))","v":"2023-05-29"},"Segunda",800,1200,1400,1700,null,null,null,0.29166666666666669,null,4.166666666666663E-2,null,null,null,0,null,null,null,{"$f":"IF($C37=\"\",0,IF($S37<=VLOOKUP($C37,PREMISSAS!$C$6:$J$13,4,FALSE),$S37,VLOOKUP($C37,PREMISSAS!$C$6:$J$13,4,FALSE)))","v":0},null,{"$f":"IF($C37=\"\",0,IF($S37>VLOOKUP($C37,PREMISSAS!$C$6:$J$13,4,FALSE),$S37-VLOOKUP($C37,PREMISSAS!$C$6:$J$13,4,FALSE),0))","v":0},null,null,null,null,null,"8:00","12:00","14:00","17:00","","",""]
[null,null,3,{"$f":"IF(D37=\"\",\"\",IF((D37+1)>'PERIODOS E FERIADOS'!$G$6,\"\",D37+1))","v":"2023-05-30"},"Terça",800,1200,1400,1700,null,null,null,0.29166666666666669,null,4.166666666666663E-2,null,null,null,0,null,null,null,{"$f":"IF($C38=\"\",0,IF($S38<=VLOOKUP($C38,PREMISSAS!$C$6:$J$13,4,FALSE),$S38,VLOOKUP($C38,PREMISSAS!$C$6:$J$13,4,FALSE)))","v":0},null,{"$f":"IF($C38=\"\",0,IF($S38>VLOOKUP($C38,PREMISSAS!$C$6:$J$13,4,FALSE),$S38-VLOOKUP($C38,PREMISSAS!$C$6:$J$13,4,FALSE),0))","v":0},null,null,null,null,null,"8:00","12:00","14:00","17:00","","",""]
[null,null,4,{"$f":"IF(D38=\"\",\"\",IF((D38+1)>'PERIODOS E FERIADOS'!$G$6,\"\",D38+1))","v":"2023-05-31"},"Quarta",800,1200,1400,1700,null,null,null,0.29166666666666669,null,4.166666666666663E-2,null,null,null,0,null,null,null,{"$f":"IF($C39=\"\",0,IF($S39<=VLOOKUP($C39,PREMISSAS!$C$6:$J$13,4,FALSE),$S39,VLOOKUP($C39,PREMISSAS!$C$6:$J$13,4,FALSE)))","v":0},null,{"$f":"IF($C39=\"\",0,IF($S39>VLOOKUP($C39,PREMISSAS!$C$6:$J$13,4,FALSE),$S39-VLOOKUP($C39,PREMISSAS!$C$6:$J$13,4,FALSE),0))","v":0},null,null,null,null,null,"8:00","12:00","14:00","17:00","","",""]
[]
[null,null,null,"TOTAIS",null,null,"Faltas / Suspensão",null,{"$f":"COUNTIF($F$9:$F$39,\"FALTA\")+COUNTIF($F$9:$F$39,\"SUSPENSÃO\")+COUNTIF($F$9:$F$39,\"SUSPENSO\")+COUNTIF($F$9:$F$39,\"SUSPENSAO\")","v":2},null,null,null,{"$f":"SUM($M$9:$M$39)","v":8.4583333333333357},null,{"$f":"SUM($O$9:$O$39)","v":0.83333333333333259},null,null,null,{"$f":"SUM(S$9:S$39)","v":2.625},null,{"$f":"$AK$41","v":0},null,{"$f":"SUM(W$9:W$39)","v":1.1666666666666667},null,{"$f":"SUM(Y$9:Y$39)","v":1.4583333333333335},null,null,null,null,null,null,null,null,null,null,null,{"$f":"SUM(AK9:AK39)","v":0}]
[]
[null,null,null,"OBSERVAÇÕES:"]

{"sheet":"FUNC 1","index":5,"n_rows":43,"n_cols":37,"rows_kept":43,"cut":false,"hidden":false,"merged":[[3,3,4,27],[5,3,5,4],[5,5,5,10],[5,12,5,20],[5,22,5,24],[5,26,5,27],[5,30,5,33],[40,3,40,5],[40,6,40,7],[40,8,40,10],[42,3,43,24],[18,26,18,27],[19,26,19,27]]}
[]
[]
[]
[null,null,null,{"$f":"'PERIODOS E FERIADOS'!$E$5","v":0}]
[]
[null,null,null,"Funcionário",null,{"$f":"FUNCIONÁRIOS!E5","v":1},null,null,null,null,null,null,"H.E. / Atrasos / A.N",null,null,null,null,null,null,null,null,null,"Distrib. H.E. p/ Faixa",null,null,null,"CARGA HORÁRIA",null,null,null,"ESPELHO"]
[]
[null,null,null,"Data","Dia Semana","Entrada","Saida","Entrada","Saida","Entrada","Saída",null,"H. Diária",null,"Atrasos",null,"Abona",null,"Horas Extras",null,"Adc. Noturno",null,{"$f":"PREMISSAS!H6","v":0.5},null,{"$f":"PREMISSAS!H12","v":1},2,"SEGUNDA",0.33333333333333331,2,null,"Entrada","Saída","Entrada","Saída","Entrada","Saída","AN "]
[null,null,{"$f":"IF(NOT(ISERROR(VLOOKUP(D9,rngFeriados,1,FALSE))),\"F\",IF(D9=\"\",\"\",WEEKDAY($D9,1)))","v":"F"},{"$f":"'PERIODOS E FERIADOS'!$E$6","v":"2023-05-01"},{"$f":"IF(D9=\"\",\"\",IF(WEEKDAY(D9,1)=1,\"Domingo\",IF(WEEKDAY(D9,1)=2,\"Segunda\",IF(WEEKDAY(D9,1)=3,\"Terça\",IF(WEEKDAY(D9,1)=4,\"Quarta\",IF(WEEKDAY(D9,1)=5,\"Quinta\",IF(WEEKDAY(D9,1)=6,\"Sexta\",IF(WEEKDAY(D9,1)=7,\"Sábado\"))))))))","v":"Segunda"},null,null,null,null,null,null,null,{"$f":"IF(ISERROR(IF(OR($AF9=\"\",$AF9=0),0,(IF(TEXT($AF9,\"[hh]:mm:ss\")<TEXT($AE9,\"[hh]:mm:ss\"),(1-$AE9+$AF9),$AF9-$AE9))+IF(OR($AH9=\"\",$AH9=0),0,(IF(TEXT($AH9,\"[hh]:mm:ss\")<TEXT($AG9,\"[hh]:mm:ss\"),(1-$AG9+$AH9),$AH9-$AG9))+IF(OR($AJ9=\"\",$AJ9=0),0,(IF(TEXT($AJ9,\"[hh]:mm:ss\")<TEXT($AI9,\"[hh]:mm:ss\"),(1-$AI9+$AJ9),$AJ9-$AI9)))))),0,IF(OR($AF9=\"\",$AF9=0),0,(IF(TEXT($AF9,\"[hh]:mm:ss\")<TEXT($AE9,\"[hh]:mm:ss\"),(1-$AE9+$AF9),$AF9-$AE9))+IF(OR($AH9=\"\",$AH9=0),0,(IF(TEXT($AH9,\"[hh]:mm:ss\")<TEXT($AG9,\"[hh]:mm:ss\"),(1-$AG9+$AH9),$AH9-$AG9))+IF(OR($AJ9=\"\",$AJ9=0),0,(IF(TEXT($AJ9,\"[hh]:mm:ss\")<TEXT($AI9,\"[hh]:mm:ss\"),(1-$AI9+$AJ9),$AJ9-$AI9))))))","v":0},null,{"$f":"IF($C9=\"\",0,IF(Q9=\"Sim\",0,IF(TEXT(IF(OR((VLOOKUP($C9,$Z$8:$AB$15,3,FALSE)-$M9)<0,$AE9=\"\"),0,(VLOOKUP($C9,$Z$8:$AB$15,3,FALSE)-$M9)),\"[hh]:mm\")<=TEXT(rngTolerancia,\"[hh]:mm\"),0,IF(OR((VLOOKUP($C9,$Z$8:$AB$15,3,FALSE)-$M9)<0,$AE9=\"\"),0,(VLOOKUP($C9,$Z$8:$AB$15,3,FALSE)-$M9)))))","v":0},null,null,null,{"$f":"IF($C9=\"\",0,IF(TEXT(IF(($M9-VLOOKUP($C9,$Z$8:$AB$15,3,FALSE))<0,0,($M9-VLOOKUP($C9,$Z$8:$AB$15,3,FALSE))),\"[hh]:mm\")<=TEXT(rngTolerancia,\"[hh]:mm\"),0,IF(($M9-VLOOKUP($C9,$Z$8:$AB$15,3,FALSE))<0,0,($M9-VLOOKUP($C9,$Z$8:$AB$15,3,FALSE)))))","v":0},null,null,null,{"$f":"IF($C9=\"\",0,IF($S9<=VLOOKUP($C9,PREMISSAS!$C$6:$J$13,4,FALSE),$S9,VLOOKUP($C9,PREMISSAS!$C$6:$J$13,4,FALSE)))","v":0},null,{"$f":"IF($C9=\"\",0,IF($S9>VLOOKUP($C9,PREMISSAS!$C$6:$J$13,4,FALSE),$S9-VLOOKUP($C9,PREMISSAS!$C$6:$J$13,4,FALSE),0))","v":0},3,"TERÇA",0.33333333333333331,3,null,{"$f":"IF(OR(F9=\"\",F9=0,F9=\"FALTA\",F9=\"SUSPENSO\",F9=\"SUSPENSÃO\"),\"\",TEXT(F9,\"##\"\":\"\"##\"))","v":""},{"$f":"IF(OR(G9=\"\",G9=0,G9=\"FALTA\",G9=\"SUSPENSO\",G9=\"SUSPENSÃO\"),\"\",TEXT(G9,\"##\"\":\"\"##\"))","v":""},"","",{"$f":"IF(OR(J9=\"\",J9=0,J9=\"FALTA\",J9=\"SUSPENSO\",J9=\"SUSPENSÃO\"),\"\",TEXT(J9,\"##\"\":\"\"##\"))","v":""},{"$f":"IF(OR(K9=\"\",K9=0,K9=\"FALTA\",K9=\"SUSPENSO\",K9=\"SUSPENSÃO\"),\"\",TEXT(K9,\"##\"\":\"\"##\"))","v":""},{"$f":"IF(OR(U9=\"\",U9=0,U9=\"FALTA\",U9=\"SUSPENSO\",U9=\"SUSPENSÃO\"),\"\",TEXT(TEXT(U9,\"00\"\":\"\"00\"),\"[hh]:mm\")*1)","v":""}]
[null,null,3,{"$f":"IF(D9=\"\",\"\",IF((D9+1)>'PERIODOS E FERIADOS'!$G$6,\"\",D9+1))","v":"2023-05-02"},{"$f":"IF(D10=\"\",\"\",IF(WEEKDAY(D10,1)=1,\"Domingo\",IF(WEEKDAY(D10,1)=2,\"Segunda\",IF(WEEKDAY(D10,1)=3,\"Terça\",IF(WEEKDAY(D10,1)=4,\"Quarta\",IF(WEEKDAY(D10,1)=5,\"Quinta\",IF(WEEKDAY(D10,1)=6,\"Sexta\",IF(WEEKDAY(D10,1)=7,\"Sábado\"))))))))","v":"Terça"},null,null,null,null,null,null,null,{"$f":"IF(ISERROR(IF(OR($AF10=\"\",$AF10=0),0,(IF(TEXT($AF10,\"[hh]:mm:ss\")<TEXT($AE10,\"[hh]:mm:ss\"),(1-$AE10+$AF10),$AF10-$AE10))+IF(OR($AH10=\"\",$AH10=0),0,(IF(TEXT($AH10,\"[hh]:mm:ss\")<TEXT($AG10,\"[hh]:mm:ss\"),(1-$AG10+$AH10),$AH10-$AG10))+IF(OR($AJ10=\"\",$AJ10=0),0,(IF(TEXT($AJ10,\"[hh]:mm:ss\")<TEXT($AI10,\"[hh]:mm:ss\"),(1-$AI10+$AJ10),$AJ10-$AI10)))))),0,IF(OR($AF10=\"\",$AF10=0),0,(IF(TEXT($AF10,\"[hh]:mm:ss\")<TEXT($AE10,\"[hh]:mm:ss\"),(1-$AE10+$AF10),$AF10-$AE10))+IF(OR($AH10=\"\",$AH10=0),0,(IF(TEXT($AH10,\"[hh]:mm:ss\")<TEXT($AG10,\"[hh]:mm:ss\"),(1-$AG10+$AH10),$AH10-$AG10))+IF(OR($AJ10=\"\",$AJ10=0),0,(IF(TEXT($AJ10,\"[hh]:mm:ss\")<TEXT($AI10,\"[hh]:mm:ss\"),(1-$AI10+$AJ10),$AJ10-$AI10))))))","v":0},null,{"$f":"IF($C10=\"\",0,IF(Q10=\"Sim\",0,IF(TEXT(IF(OR((VLOOKUP($C10,$Z$8:$AB$15,3,FALSE)-$M10)<0,$AE10=\"\"),0,(VLOOKUP($C10,$Z$8:$AB$15,3,FALSE)-$M10)),\"[hh]:mm\")<=TEXT(rngTolerancia,\"[hh]:mm\"),0,IF(OR((VLOOKUP($C10,$Z$8:$AB$15,3,FALSE)-$M10)<0,$AE10=\"\"),0,(VLOOKUP($C10,$Z$8:$AB$15,3,FALSE)-$M10)))))","v":0},null,null,null,0,null,null,null,{"$f":"IF($C10=\"\",0,IF($S10<=VLOOKUP($C10,PREMISSAS!$C$6:$J$13,4,FALSE),$S10,VLOOKUP($C10,PREMISSAS!$C$6:$J$13,4,FALSE)))","v":0},null,{"$f":"IF($C10=\"\",0,IF($S10>VLOOKUP($C10,PREMISSAS!$C$6:$J$13,4,FALSE),$S10-VLOOKUP($C10,PREMISSAS!$C$6:$J$13,4,FALSE),0))","v":0},4,"QUARTA",0.33333333333333331,4,null,{"$f":"IF(OR(F10=\"\",F10=0,F10=\"FALTA\",F10=\"SUSPENSO\",F10=\"SUSPENSÃO\"),\"\",TEXT(F10,\"##\"\":\"\"##\"))","v":""},"","","","","",{"$f":"IF(OR(U10=\"\",U10=0,U10=\"FALTA\",U10=\"SUSPENSO\",U10=\"SUSPENSÃO\"),\"\",TEXT(TEXT(U10,\"00\"\":\"\"00\"),\"[hh]:mm\")*1)","v":""}]
[null,null,4,{"$f":"IF(D10=\"\",\"\",IF((D10+1)>'PERIODOS E FERIADOS'!$G$6,\"\",D10+1))","v":"2023-05-03"},"Quarta",null,null,null,null,null,null,null,0,null,0,null,null,null,0,null,null,null,{"$f":"IF($C11=\"\",0,IF($S11<=VLOOKUP($C11,PREMISSAS!$C$6:$J$13,4,FALSE),$S11,VLOOKUP($C11,PREMISSAS!$C$6:$J$13,4,FALSE)))","v":0},null,{"$f":"IF($C11=\"\",0,IF($S11>VLOOKUP($C11,PREMISSAS!$C$6:$J$13,4,FALSE),$S11-VLOOKUP($C11,PREMISSAS!$C$6:$J$13,4,FALSE),0))","v":0},5,"QUINTA",0.33333333333333331,5,null,"","","","","","",""]
[null,null,5,{"$f":"IF(D11=\"\",\"\",IF((D11+1)>'PERIODOS E FERIADOS'!$G$6,\"\",D11+1))","v":"2023-05-04"},"Quinta",null,null,null,null,null,null,null,0,null,0,null,null,null,0,null,null,null,{"$f":"IF($C12=\"\",0,IF($S12<=VLOOKUP($C12,PREMISSAS!$C$6:$J$13,4,FALSE),$S12,VLOOKUP($C12,PREMISSAS!$C$6:$J$13,4,FALSE)))","v":0},null,{"$f":"IF($C12=\"\",0,IF($S12>VLOOKUP($C12,PREMISSAS!$C$6:$J$13,4,FALSE),$S12-VLOOKUP($C12,PREMISSAS!$C$6:$J$13,4,FALSE),0))","v":0},6,"SEXTA",0.33333333333333331,6,null,"","","","","","",{"$f":"IF(OR(U12=\"\",U12=0,U12=\"FALTA\",U12=\"SUSPENSO\",U12=\"SUSPENSÃO\"),\"\",TEXT(TEXT(U12,\"##\"\":\"\"##\"),\"[hh]:mm\")*1)","v":""}]
[null,null,6,{"$f":"IF(D12=\"\",\"\",IF((D12+1)>'PERIODOS E FERIADOS'!$G$6,\"\",D12+1))","v":"2023-05-05"},"Sexta",null,null,null,null,null,null,null,0,null,0,null,null,null,0,null,null,null,{"$f":"IF($C13=\"\",0,IF($S13<=VLOOKUP($C13,PREMISSAS!$C$6:$J$13,4,FALSE),$S13,VLOOKUP($C13,PREMISSAS!$C$6:$J$13,4,FALSE)))","v":0},null,{"$f":"IF($C13=\"\",0,IF($S13>VLOOKUP($C13,PREMISSAS!$C$6:$J$13,4,FALSE),$S13-VLOOKUP($C13,PREMISSAS!$C$6:$J$13,4,FALSE),0))","v":0},7,"SÁBADO",0.16666666666666666,7,null,"","","","","","",""]
[null,null,7,{"$f":"IF(D13=\"\",\"\",IF((D13+1)>'PERIODOS E FERIADOS'!$G$6,\"\",D13+1))","v":"2023-05-06"},"Sábado",null,null,null,null,null,null,null,0,null,0,null,null,null,0,null,null,null,{"$f":"IF($C14=\"\",0,IF($S14<=VLOOKUP($C14,PREMISSAS!$C$6:$J$13,4,FALSE),$S14,VLOOKUP($C14,PREMISSAS!$C$6:$J$13,4,FALSE)))","v":0},null,{"$f":"IF($C14=\"\",0,IF($S14>VLOOKUP($C14,PREMISSAS!$C$6:$J$13,4,FALSE),$S14-VLOOKUP($C14,PREMISSAS!$C$6:$J$13,4,FALSE),0))","v":0},1,"DOMINGO",null,1,null,"","","","","","",""]
[null,null,1,{"$f":"IF(D14=\"\",\"\",IF((D14+1)>'PERIODOS E FERIADOS'!$G$6,\"\",D14+1))","v":"2023-05-07"},"Domingo",null,null,null,null,null,null,null,0,null,0,null,null,null,0,null,null,null,{"$f":"IF($C15=\"\",0,IF($S15<=VLOOKUP($C15,PREMISSAS!$C$6:$J$13,4,FALSE),$S15,VLOOKUP($C15,PREMISSAS!$C$6:$J$13,4,FALSE)))","v":0},null,{"$f":"IF($C15=\"\",0,IF($S15>VLOOKUP($C15,PREMISSAS!$C$6:$J$13,4,FALSE),$S15-VLOOKUP($C15,PREMISSAS!$C$6:$J$13,4,FALSE),0))","v":0},"F","FERIADOS",0,"F",null,"","","","","","",""]
[null,null,2,{"$f":"IF(D15=\"\",\"\",IF((D15+1)>'PERIODOS E FERIADOS'!$G$6,\"\",D15+1))","v":"2023-05-08"},"Segunda",null,null,null,null,null,null,null,0,null,0,null,null,null,0,null,null,null,{"$f":"IF($C16=\"\",0,IF($S16<=VLOOKUP($C16,PREMISSAS!$C$6:$J$13,4,FALSE),$S16,VLOOKUP($C16,PREMISSAS!$C$6:$J$13,4,FALSE)))","v":0},null,{"$f":"IF($C16=\"\",0,IF($S16>VLOOKUP($C16,PREMISSAS!$C$6:$J$13,4,FALSE),$S16-VLOOKUP($C16,PREMISSAS!$C$6:$J$13,4,FALSE),0))","v":0},null,"TOTAL SEMANA",{"$f":"SUM(AB8:AB15)","v":1.8333333333333333},null,null,"","","","","","",""]
[null,null,3,{"$f":"IF(D16=\"\",\"\",IF((D16+1)>'PERIODOS E FERIADOS'!$G$6,\"\",D16+1))","v":"2023-05-09"},"Terça",null,null,null,null,null,null,null,0,null,0,null,null,null,0,null,null,null,{"$f":"IF($C17=\"\",0,IF($S17<=VLOOKUP($C17,PREMISSAS!$C$6:$J$13,4,FALSE),$S17,VLOOKUP($C17,PREMISSAS!$C$6:$J$13,4,FALSE)))","v":0},null,{"$f":"IF($C17=\"\",0,IF($S17>VLOOKUP($C17,PREMISSAS!$C$6:$J$13,4,FALSE),$S17-VLOOKUP($C17,PREMISSAS!$C$6:$J$13,4,FALSE),0))","v":0},null,"JORNADA MENSAL",{"$f":"AB16*5","v":9.1666666666666661},null,null,"","","","","","",""]
[null,null,4,{"$f":"IF(D17=\"\",\"\",IF((D17+1)>'PERIODOS E FERIADOS'!$G$6,\"\",D17+1))","v":"2023-05-10"},"Quarta",null,null,null,null,null,null,null,0,null,0,null,null,null,0,null,null,null,{"$f":"IF($C18=\"\",0,IF($S18<=VLOOKUP($C18,PREMISSAS!$C$6:$J$13,4,FALSE),$S18,VLOOKUP($C18,PREMISSAS!$C$6:$J$13,4,FALSE)))","v":0},null,{"$f":"IF($C18=\"\",0,IF($S18>VLOOKUP($C18,PREMISSAS!$C$6:$J$13,4,FALSE),$S18-VLOOKUP($C18,PREMISSAS!$C$6:$J$13,4,FALSE),0))","v":0},null,null,null,null,null,"","","","","","",""]
[null,null,5,{"$f":"IF(D18=\"\",\"\",IF((D18+1)>'PERIODOS E FERIADOS'!$G$6,\"\",D18+1))","v":"2023-05-11"},"Quinta",null,null,null,null,null,null,null,0,null,0,null,null,null,0,null,null,null,{"$f":"IF($C19=\"\",0,IF($S19<=VLOOKUP($C19,PREMISSAS!$C$6:$J$13,4,FALSE),$S19,VLOOKUP($C19,PREMISSAS!$C$6:$J$13,4,FALSE)))","v":0},null,{"$f":"IF($C19=\"\",0,IF($S19>VLOOKUP($C19,PREMISSAS!$C$6:$J$13,4,FALSE),$S19-VLOOKUP($C19,PREMISSAS!$C$6:$J$13,4,FALSE),0))","v":0},null,{"$f":"IF(AB$16>AB$23,\"Jornada Superior a permitida\",IF(AB$16<=AB$23,\"\"))","v":""},null,null,null,"","","","","","",""]
[null,null,6,{"$f":"IF(D19=\"\",\"\",IF((D19+1)>'PERIODOS E FERIADOS'!$G$6,\"\",D19+1))","v":"2023-05-12"},"Sexta",null,null,null,null,null,null,null,0,null,0,null,null,null,0,null,null,null,{"$f":"IF($C20=\"\",0,IF($S20<=VLOOKUP($C20,PREMISSAS!$C$6:$J$13,4,FALSE),$S20,VLOOKUP($C20,PREMISSAS!$C$6:$J$13,4,FALSE)))","v":0},null,{"$f":"IF($C20=\"\",0,IF($S20>VLOOKUP($C20,PREMISSAS!$C$6:$J$13,4,FALSE),$S20-VLOOKUP($C20,PREMISSAS!$C$6:$J$13,4,FALSE),0))","v":0},null,{"$f":"IF(AB$16>AB$23,\"\",IF(AB$16<=AB$23,\"Jornada Ok\"))","v":"Jornada Ok"},null,null,null,"","","","","","",""]
[null,null,7,{"$f":"IF(D20=\"\",\"\",IF((D20+1)>'PERIODOS E FERIADOS'!$G$6,\"\",D20+1))","v":"2023-05-13"},"Sábado",null,null,null,null,null,null,null,0,null,0,null,null,null,0,null,null,null,{"$f":"IF($C21=\"\",0,IF($S21<=VLOOKUP($C21,PREMISSAS!$C$6:$J$13,4,FALSE),$S21,VLOOKUP($C21,PREMISSAS!$C$6:$J$13,4,FALSE)))","v":0},null,{"$f":"IF($C21=\"\",0,IF($S21>VLOOKUP($C21,PREMISSAS!$C$6:$J$13,4,FALSE),$S21-VLOOKUP($C21,PREMISSAS!$C$6:$J$13,4,FALSE),0))","v":0},null,null,null,null,null,"","","","","","",""]
[null,null,1,{"$f":"IF(D21=\"\",\"\",IF((D21+1)>'PERIODOS E FERIADOS'!$G$6,\"\",D21+1))","v":"2023-05-14"},"Domingo",null,null,null,null,null,null,null,0,null,0,null,null,null,0,null,null,null,{"$f":"IF($C22=\"\",0,IF($S22<=VLOOKUP($C22,PREMISSAS!$C$6:$J$13,4,FALSE),$S22,VLOOKUP($C22,PREMISSAS!$C$6:$J$13,4,FALSE)))","v":0},null,{"$f":"IF($C22=\"\",0,IF($S22>VLOOKUP($C22,PREMISSAS!$C$6:$J$13,4,FALSE),$S22-VLOOKUP($C22,PREMISSAS!$C$6:$J$13,4,FALSE),0))","v":0},null,null,null,null,null,"","","","","","",""]
[null,null,2,{"$f":"IF(D22=\"\",\"\",IF((D22+1)>'PERIODOS E FERIADOS'!$G$6,\"\",D22+1))","v":"2023-05-15"},"Segunda",null,null,null,null,null,null,null,0,null,0,null,null,null,0,null,null,null,{"$f":"IF($C23=\"\",0,IF($S23<=VLOOKUP($C23,PREMISSAS!$C$6:$J$13,4,FALSE),$S23,VLOOKUP($C23,PREMISSAS!$C$6:$J$13,4,FALSE)))","v":0},null,{"$f":"IF($C23=\"\",0,IF($S23>VLOOKUP($C23,PREMISSAS!$C$6:$J$13,4,FALSE),$S23-VLOOKUP($C23,PREMISSAS!$C$6:$J$13,4,FALSE),0))","v":0},null,"Jornada Maxima",1.8333333333333333,null,null,"","","","","","",""]
[null,null,3,{"$f":"IF(D23=\"\",\"\",IF((D23+1)>'PERIODOS E FERIADOS'!$G$6,\"\",D23+1))","v":"2023-05-16"},"Terça",null,null,null,null,null,null,null,0,null,0,null,null,null,0,null,null,null,{"$f":"IF($C24=\"\",0,IF($S24<=VLOOKUP($C24,PREMISSAS!$C$6:$J$13,4,FALSE),$S24,VLOOKUP($C24,PREMISSAS!$C$6:$J$13,4,FALSE)))","v":0},null,{"$f":"IF($C24=\"\",0,IF($S24>VLOOKUP($C24,PREMISSAS!$C$6:$J$13,4,FALSE),$S24-VLOOKUP($C24,PREMISSAS!$C$6:$J$13,4,FALSE),0))","v":0},null,null,null,null,null,"","","","","","",""]
[null,null,4,{"$f":"IF(D24=\"\",\"\",IF((D24+1)>'PERIODOS E FERIADOS'!$G$6,\"\",D24+1))","v":"2023-05-17"},"Quarta",null,null,null,null,null,null,null,0,null,0,null,null,null,0,null,null,null,{"$f":"IF($C25=\"\",0,IF($S25<=VLOOKUP($C25,PREMISSAS!$C$6:$J$13,4,FALSE),$S25,VLOOKUP($C25,PREMISSAS!$C$6:$J$13,4,FALSE)))","v":0},null,{"$f":"IF($C25=\"\",0,IF($S25>VLOOKUP($C25,PREMISSAS!$C$6:$J$13,4,FALSE),$S25-VLOOKUP($C25,PREMISSAS!$C$6:$J$13,4,FALSE),0))","v":0},null,null,null,null,null,"","","","","","",""]
[null,null,5,{"$f":"IF(D25=\"\",\"\",IF((D25+1)>'PERIODOS E FERIADOS'!$G$6,\"\",D25+1))","v":"2023-05-18"},"Quinta",null,null,null,null,null,null,null,0,null,0,null,null,null,0,null,null,null,{"$f":"IF($C26=\"\",0,IF($S26<=VLOOKUP($C26,PREMISSAS!$C$6:$J$13,4,FALSE),$S26,VLOOKUP($C26,PREMISSAS!$C$6:$J$13,4,FALSE)))","v":0},null,{"$f":"IF($C26=\"\",0,IF($S26>VLOOKUP($C26,PREMISSAS!$C$6:$J$13,4,FALSE),$S26-VLOOKUP($C26,PREMISSAS!$C$6:$J$13,4,FALSE),0))","v":0},null,null,null,null,null,"","","","","","",""]
[null,null,6,{"$f":"IF(D26=\"\",\"\",IF((D26+1)>'PERIODOS E FERIADOS'!$G$6,\"\",D26+1))","v":"2023-05-19"},"Sexta",null,null,null,null,null,null,null,0,null,0,null,null,null,0,null,null,null,{"$f":"IF($C27=\"\",0,IF($S27<=VLOOKUP($C27,PREMISSAS!$C$6:$J$13,4,FALSE),$S27,VLOOKUP($C27,PREMISSAS!$C$6:$J$13,4,FALSE)))","v":0},null,{"$f":"IF($C27=\"\",0,IF($S27>VLOOKUP($C27,PREMISSAS!$C$6:$J$13,4,FALSE),$S27-VLOOKUP($C27,PREMISSAS!$C$6:$J$13,4,FALSE),0))","v":0},null,null,null,null,null,"","","","","","",""]
[null,null,7,{"$f":"IF(D27=\"\",\"\",IF((D27+1)>'PERIODOS E FERIADOS'!$G$6,\"\",D27+1))","v":"2023-05-20"},"Sábado",null,null,null,null,null,null,null,0,null,0,null,null,null,0,null,null,null,{"$f":"IF($C28=\"\",0,IF($S28<=VLOOKUP($C28,PREMISSAS!$C$6:$J$13,4,FALSE),$S28,VLOOKUP($C28,PREMISSAS!$C$6:$J$13,4,FALSE)))","v":0},null,{"$f":"IF($C28=\"\",0,IF($S28>VLOOKUP($C28,PREMISSAS!$C$6:$J$13,4,FALSE),$S28-VLOOKUP($C28,PREMISSAS!$C$6:$J$13,4,FALSE),0))","v":0},null,null,null,null,null,"","","","","","",""]
[null,null,1,{"$f":"IF(D28=\"\",\"\",IF((D28+1)>'PERIODOS E FERIADOS'!$G$6,\"\",D28+1))","v":"2023-05-21"},"Domingo",null,null,null,null,null,null,null,0,null,0,null,null,null,0,null,null,null,{"$f":"IF($C29=\"\",0,IF($S29<=VLOOKUP($C29,PREMISSAS!$C$6:$J$13,4,FALSE),$S29,VLOOKUP($C29,PREMISSAS!$C$6:$J$13,4,FALSE)))","v":0},null,{"$f":"IF($C29=\"\",0,IF($S29>VLOOKUP($C29,PREMISSAS!$C$6:$J$13,4,FALSE),$S29-VLOOKUP($C29,PREMISSAS!$C$6:$J$13,4,FALSE),0))","v":0},null,null,null,null,null,"","","","","","",""]
[null,null,2,{"$f":"IF(D29=\"\",\"\",IF((D29+1)>'PERIODOS E FERIADOS'!$G$6,\"\",D29+1))","v":"2023-05-22"},"Segunda",null,null,null,null,null,null,null,0,null,0,null,null,null,0,null,null,null,{"$f":"IF($C30=\"\",0,IF($S30<=VLOOKUP($C30,PREMISSAS!$C$6:$J$13,4,FALSE),$S30,VLOOKUP($C30,PREMISSAS!$C$6:$J$13,4,FALSE)))","v":0},null,{"$f":"IF($C30=\"\",0,IF($S30>VLOOKUP($C30,PREMISSAS!$C$6:$J$13,4,FALSE),$S30-VLOOKUP($C30,PREMISSAS!$C$6:$J$13,4,FALSE),0))","v":0},null,null,null,null,null,"","","","","","",""]
[null,null,3,{"$f":"IF(D30=\"\",\"\",IF((D30+1)>'PERIODOS E FERIADOS'!$G$6,\"\",D30+1))","v":"2023-05-23"},"Terça",null,null,null,null,null,null,null,0,null,0,null,null,null,0,null,null,null,{"$f":"IF($C31=\"\",0,IF($S31<=VLOOKUP($C31,PREMISSAS!$C$6:$J$13,4,FALSE),$S31,VLOOKUP($C31,PREMISSAS!$C$6:$J$13,4,FALSE)))","v":0},null,{"$f":"IF($C31=\"\",0,IF($S31>VLOOKUP($C31,PREMISSAS!$C$6:$J$13,4,FALSE),$S31-VLOOKUP($C31,PREMISSAS!$C$6:$J$13,4,FALSE),0))","v":0},null,null,null,null,null,"","","","","","",""]
[null,null,4,{"$f":"IF(D31=\"\",\"\",IF((D31+1)>'PERIODOS E FERIADOS'!$G$6,\"\",D31+1))","v":"2023-05-24"},"Quarta",null,null,null,null,null,null,null,0,null,0,null,null,null,0,null,null,null,{"$f":"IF($C32=\"\",0,IF($S32<=VLOOKUP($C32,PREMISSAS!$C$6:$J$13,4,FALSE),$S32,VLOOKUP($C32,PREMISSAS!$C$6:$J$13,4,FALSE)))","v":0},null,{"$f":"IF($C32=\"\",0,IF($S32>VLOOKUP($C32,PREMISSAS!$C$6:$J$13,4,FALSE),$S32-VLOOKUP($C32,PREMISSAS!$C$6:$J$13,4,FALSE),0))","v":0},null,null,null,null,null,{"$f":"IF(OR(F32=\"\",F32=0,F32=\"FALTA\",F32=\"SUSPENSO\",F32=\"SUSPENSÃO\"),\"\",TEXT(F32,\"##\"\":\"\"##\"))","v":""},{"$f":"IF(OR(G32=\"\",G32=0,G32=\"FALTA\",G32=\"SUSPENSO\",G32=\"SUSPENSÃO\"),\"\",TEXT(G32,\"##\"\":\"\"##\"))","v":""},"","",{"$f":"IF(OR(J32=\"\",J32=0,J32=\"FALTA\",J32=\"SUSPENSO\",J32=\"SUSPENSÃO\"),\"\",TEXT(J32,\"##\"\":\"\"##\"))","v":""},{"$f":"IF(OR(K32=\"\",K32=0,K32=\"FALTA\",K32=\"SUSPENSO\",K32=\"SUSPENSÃO\"),\"\",TEXT(K32,\"##\"\":\"\"##\"))","v":""},""]
[null,null,5,{"$f":"IF(D32=\"\",\"\",IF((D32+1)>'PERIODOS E FERIADOS'!$G$6,\"\",D32+1))","v":"2023-05-25"},"Quinta",null,null,null,null,null,null,null,0,null,0,null,null,null,0,null,null,null,{"$f":"IF($C33=\"\",0,IF($S33<=VLOOKUP($C33,PREMISSAS!$C$6:$J$13,4,FALSE),$S33,VLOOKUP($C33,PREMISSAS!$C$6:$J$13,4,FALSE)))","v":0},null,{"$f":"IF($C33=\"\",0,IF($S33>VLOOKUP($C33,PREMISSAS!$C$6:$J$13,4,FALSE),$S33-VLOOKUP($C33,PREMISSAS!$C$6:$J$13,4,FALSE),0))","v":0},null,null,null,null,null,{"$f":"IF(OR(F33=\"\",F33=0,F33=\"FALTA\",F33=\"SUSPENSO\",F33=\"SUSPENSÃO\"),\"\",TEXT(F33,\"##\"\":\"\"##\"))","v":""},"","","","","",""]
[null,null,6,{"$f":"IF(D33=\"\",\"\",IF((D33+1)>'PERIODOS E FERIADOS'!$G$6,\"\",D33+1))","v":"2023-05-26"},"Sexta",null,null,null,null,null,null,null,0,null,0,null,null,null,0,null,null,null,{"$f":"IF($C34=\"\",0,IF($S34<=VLOOKUP($C34,PREMISSAS!$C$6:$J$13,4,FALSE),$S34,VLOOKUP($C34,PREMISSAS!$C$6:$J$13,4,FALSE)))","v":0},null,{"$f":"IF($C34=\"\",0,IF($S34>VLOOKUP($C34,PREMISSAS!$C$6:$J$13,4,FALSE),$S34-VLOOKUP($C34,PREMISSAS!$C$6:$J$13,4,FALSE),0))","v":0},null,null,null,null,null,"","","","","","",""]
[null,null,7,{"$f":"IF(D34=\"\",\"\",IF((D34+1)>'PERIODOS E FERIADOS'!$G$6,\"\",D34+1))","v":"2023-05-27"},"Sábado",null,null,null,null,null,null,null,0,null,0,null,null,null,0,null,null,null,{"$f":"IF($C35=\"\",0,IF($S35<=VLOOKUP($C35,PREMISSAS!$C$6:$J$13,4,FALSE),$S35,VLOOKUP($C35,PREMISSAS!$C$6:$J$13,4,FALSE)))","v":0},null,{"$f":"IF($C35=\"\",0,IF($S35>VLOOKUP($C35,PREMISSAS!$C$6:$J$13,4,FALSE),$S35-VLOOKUP($C35,PREMISSAS!$C$6:$J$13,4,FALSE),0))","v":0},null,null,null,null,null,"","","","","","",""]
[null,null,1,{"$f":"IF(D35=\"\",\"\",IF((D35+1)>'PERIODOS E FERIADOS'!$G$6,\"\",D35+1))","v":"2023-05-28"},"Domingo",null,null,null,null,null,null,null,0,null,0,null,null,null,0,null,null,null,{"$f":"IF($C36=\"\",0,IF($S36<=VLOOKUP($C36,PREMISSAS!$C$6:$J$13,4,FALSE),$S36,VLOOKUP($C36,PREMISSAS!$C$6:$J$13,4,FALSE)))","v":0},null,{"$f":"IF($C36=\"\",0,IF($S36>VLOOKUP($C36,PREMISSAS!$C$6:$J$13,4,FALSE),$S36-VLOOKUP($C36,PREMISSAS!$C$6:$J$13,4,FALSE),0))","v":0},null,null,null,null,null,"","","","","","",""]
[null,null,2,{"$f":"IF(D36=\"\",\"\",IF((D36+1)>'PERIODOS E FERIADOS'!$G$6,\"\",D36+1))","v":"2023-05-29"},"Segunda",null,null,null,null,null,null,null,0,null,0,null,null,null,0,null,null,null,{"$f":"IF($C37=\"\",0,IF($S37<=VLOOKUP($C37,PREMISSAS!$C$6:$J$13,4,FALSE),$S37,VLOOKUP($C37,PREMISSAS!$C$6:$J$13,4,FALSE)))","v":0},null,{"$f":"IF($C37=\"\",0,IF($S37>VLOOKUP($C37,PREMISSAS!$C$6:$J$13,4,FALSE),$S37-VLOOKUP($C37,PREMISSAS!$C$6:$J$13,4,FALSE),0))","v":0},null,null,null,null,null,"","","","","","",""]
[null,null,3,{"$f":"IF(D37=\"\",\"\",IF((D37+1)>'PERIODOS E FERIADOS'!$G$6,\"\",D37+1))","v":"2023-05-30"},"Terça",null,null,null,null,null,null,null,0,null,0,null,null,null,0,null,null,null,{"$f":"IF($C38=\"\",0,IF($S38<=VLOOKUP($C38,PREMISSAS!$C$6:$J$13,4,FALSE),$S38,VLOOKUP($C38,PREMISSAS!$C$6:$J$13,4,FALSE)))","v":0},null,{"$f":"IF($C38=\"\",0,IF($S38>VLOOKUP($C38,PREMISSAS!$C$6:$J$13,4,FALSE),$S38-VLOOKUP($C38,PREMISSAS!$C$6:$J$13,4,FALSE),0))","v":0},null,null,null,null,null,"","","","","","",""]
[null,null,4,{"$f":"IF(D38=\"\",\"\",IF((D38+1)>'PERIODOS E FERIADOS'!$G$6,\"\",D38+1))","v":"2023-05-31"},"Quarta",null,null,null,null,null,null,null,0,null,0,null,null,null,0,null,null,null,{"$f":"IF($C39=\"\",0,IF($S39<=VLOOKUP($C39,PREMISSAS!$C$6:$J$13,4,FALSE),$S39,VLOOKUP($C39,PREMISSAS!$C$6:$J$13,4,FALSE)))","v":0},null,{"$f":"IF($C39=\"\",0,IF($S39>VLOOKUP($C39,PREMISSAS!$C$6:$J$13,4,FALSE),$S39-VLOOKUP($C39,PREMISSAS!$C$6:$J$13,4,FALSE),0))","v":0},null,null,null,null,null,"","","","","","",""]
[]
[null,null,null,"TOTAIS",null,null,"Faltas / Suspensão",null,{"$f":"COUNTIF($F$9:$F$39,\"FALTA\")+COUNTIF($F$9:$F$39,\"SUSPENSÃO\")+COUNTIF($F$9:$F$39,\"SUSPENSO\")+COUNTIF($F$9:$F$39,\"SUSPENSAO\")","v":0},null,null,null,{"$f":"SUM($M$9:$M$39)","v":0},null,{"$f":"SUM($O$9:$O$39)","v":0},null,null,null,{"$f":"SUM(S$9:S$39)","v":0},{"$f":"SUM(T$9:T$39)","v":0},0,0,0,0,0,null,null,null,null,null,null,null,null,null,null,null,{"$f":"SUM(AK9:AK39)","v":0}]
[]
[null,null,null,"OBSERVAÇÕES:"]

{"sheet":"FUNC 2","index":6,"n_rows":43,"n_cols":37,"rows_kept":43,"cut":false,"hidden":false,"merged":[[5,30,5,33],[40,3,40,5],[40,6,40,7],[40,8,40,10],[42,3,43,24],[18,26,18,27],[19,26,19,27],[3,3,4,27],[5,3,5,4],[5,5,5,10],[5,12,5,20],[5,22,5,24],[5,26,5,27]]}
[]
[]
[]
[null,null,null,{"$f":"'PERIODOS E FERIADOS'!$E$5","v":0}]
[]
[null,null,null,"Funcionário",null,{"$f":"FUNCIONÁRIOS!E6","v":2},null,null,null,null,null,null,"H.E. / Atrasos / A.N",null,null,null,null,null,null,null,null,null,"Distrib. H.E. p/ Faixa",null,null,null,"CARGA HORÁRIA",null,null,null,"ESPELHO"]
[]
[null,null,null,"Data","Dia Semana","Entrada","Saída","Entrada","Saída","Entrada","Saída",null,"H. Diária",null,"Atrasos",null,"Abona",null,"Horas Extras",null,"Adc. Noturno",null,{"$f":"PREMISSAS!H6","v":0.5},null,{"$f":"PREMISSAS!H12","v":1},2,"SEGUNDA",0.33333333333333331,2,null,"Entrada","Saída","Entrada","Saída","Entrada","Saída","AN "]
[null,null,{"$f":"IF(NOT(ISERROR(VLOOKUP(D9,rngFeriados,1,FALSE))),\"F\",IF(D9=\"\",\"\",WEEKDAY($D9,1)))","v":"F"},{"$f":"'PERIODOS E FERIADOS'!$E$6","v":"2023-05-01"},{"$f":"IF(D9=\"\",\"\",IF(WEEKDAY(D9,1)=1,\"Domingo\",IF(WEEKDAY(D9,1)=2,\"Segunda\",IF(WEEKDAY(D9,1)=3,\"Terça\",IF(WEEKDAY(D9,1)=4,\"Quarta\",IF(WEEKDAY(D9,1)=5,\"Quinta\",IF(WEEKDAY(D9,1)=6,\"Sexta\",IF(WEEKDAY(D9,1)=7,\"Sábado\"))))))))","v":"Segunda"},null,null,null,null,null,null,null,{"$f":"IF(ISERROR(IF(OR($AF9=\"\",$AF9=0),0,(IF(TEXT($AF9,\"[hh]:mm:ss\")<TEXT($AE9,\"[hh]:mm:ss\"),(1-$AE9+$AF9),$AF9-$AE9))+IF(OR($AH9=\"\",$AH9=0),0,(IF(TEXT($AH9,\"[hh]:mm:ss\")<TEXT($AG9,\"[hh]:mm:ss\"),(1-$AG9+$AH9),$AH9-$AG9))+IF(OR($AJ9=\"\",$AJ9=0),0,(IF(TEXT($AJ9,\"[hh]:mm:ss\")<TEXT($AI9,\"[hh]:mm:ss\"),(1-$AI9+$AJ9),$AJ9-$AI9)))))),0,IF(OR($AF9=\"\",$AF9=0),0,(IF(TEXT($AF9,\"[hh]:mm:ss\")<TEXT($AE9,\"[hh]:mm:ss\"),(1-$AE9+$AF9),$AF9-$AE9))+IF(OR($AH9=\"\",$AH9=0),0,(IF(TEXT($AH9,\"[hh]:mm:ss\")<TEXT($AG9,\"[hh]:mm:ss\"),(1-$AG9+$AH9),$AH9-$AG9))+IF(OR($AJ9=\"\",$AJ9=0),0,(IF(TEXT($AJ9,\"[hh]:mm:ss\")<TEXT($AI9,\"[hh]:mm:ss\"),(1-$AI9+$AJ9),$AJ9-$AI9))))))","v":0},null,{"$f":"IF($C9=\"\",0,IF(Q9=\"Sim\",0,IF(TEXT(IF(OR((VLOOKUP($C9,$Z$8:$AB$15,3,FALSE)-$M9)<0,$AE9=\"\"),0,(VLOOKUP($C9,$Z$8:$AB$15,3,FALSE)-$M9)),\"[hh]:mm\")<=TEXT(rngTolerancia,\"[hh]:mm\"),0,IF(OR((VLOOKUP($C9,$Z$8:$AB$15,3,FALSE)-$M9)<0,$AE9=\"\"),0,(VLOOKUP($C9,$Z$8:$AB$15,3,FALSE)-$M9)))))","v":0},null,null,null,{"$f":"IF($C9=\"\",0,IF(TEXT(IF(($M9-VLOOKUP($C9,$Z$8:$AB$15,3,FALSE))<0,0,($M9-VLOOKUP($C9,$Z$8:$AB$15,3,FALSE))),\"[hh]:mm\")<=TEXT(rngTolerancia,\"[hh]:mm\"),0,IF(($M9-VLOOKUP($C9,$Z$8:$AB$15,3,FALSE))<0,0,($M9-VLOOKUP($C9,$Z$8:$AB$15,3,FALSE)))))","v":0},null,null,null,{"$f":"IF($C9=\"\",0,IF($S9<=VLOOKUP($C9,PREMISSAS!$C$6:$J$13,4,FALSE),$S9,VLOOKUP($C9,PREMISSAS!$C$6:$J$13,4,FALSE)))","v":0},null,{"$f":"IF($C9=\"\",0,IF($S9>VLOOKUP($C9,PREMISSAS!$C$6:$J$13,4,FALSE),$S9-VLOOKUP($C9,PREMISSAS!$C$6:$J$13,4,FALSE),0))","v":0},3,"TERÇA",0.33333333333333331,3,null,{"$f":"IF(OR(F9=\"\",F9=0,F9=\"FALTA\",F9=\"SUSPENSO\",F9=\"SUSPENSÃO\"),\"\",TEXT(F9,\"##\"\":\"\"##\"))","v":""},{"$f":"IF(OR(G9=\"\",G9=0,G9=\"FALTA\",G9=\"SUSPENSO\",G9=\"SUSPENSÃO\"),\"\",TEXT(G9,\"##\"\":\"\"##\"))","v":""},"","",{"$f":"IF(OR(J9=\"\",J9=0,J9=\"FALTA\",J9=\"SUSPENSO\",J9=\"SUSPENSÃO\"),\"\",TEXT(J9,\"##\"\":\"\"##\"))","v":""},{"$f":"IF(OR(K9=\"\",K9=0,K9=\"FALTA\",K9=\"SUSPENSO\",K9=\"SUSPENSÃO\"),\"\",TEXT(K9,\"##\"\":\"\"##\"))","v":""},{"$f":"IF(OR(U9=\"\",U9=0,U9=\"FALTA\",U9=\"SUSPENSO\",U9=\"SUSPENSÃO\"),\"\",TEXT(TEXT(U9,\"00\"\":\"\"00\"),\"[hh]:mm\")*1)","v":""}]
[null,null,3,{"$f":"IF(D9=\"\",\"\",IF((D9+1)>'PERIODOS E FERIADOS'!$G$6,\"\",D9+1))","v":"2023-05-02"},{"$f":"IF(D10=\"\",\"\",IF(WEEKDAY(D10,1)=1,\"Domingo\",IF(WEEKDAY(D10,1)=2,\"Segunda\",IF(WEEKDAY(D10,1)=3,\"Terça\",IF(WEEKDAY(D10,1)=4,\"Quarta\",IF(WEEKDAY(D10,1)=5,\"Quinta\",IF(WEEKDAY(D10,1)=6,\"Sexta\",IF(WEEKDAY(D10,1)=7,\"Sábado\"))))))))","v":"Terça"},null,null,null,null,null,null,null,{"$f":"IF(ISERROR(IF(OR($AF10=\"\",$AF10=0),0,(IF(TEXT($AF10,\"[hh]:mm:ss\")<TEXT($AE10,\"[hh]:mm:ss\"),(1-$AE10+$AF10),$AF10-$AE10))+IF(OR($AH10=\"\",$AH10=0),0,(IF(TEXT($AH10,\"[hh]:mm:ss\")<TEXT($AG10,\"[hh]:mm:ss\"),(1-$AG10+$AH10),$AH10-$AG10))+IF(OR($AJ10=\"\",$AJ10=0),0,(IF(TEXT($AJ10,\"[hh]:mm:ss\")<TEXT($AI10,\"[hh]:mm:ss\"),(1-$AI10+$AJ10),$AJ10-$AI10)))))),0,IF(OR($AF10=\"\",$AF10=0),0,(IF(TEXT($AF10,\"[hh]:mm:ss\")<TEXT($AE10,\"[hh]:mm:ss\"),(1-$AE10+$AF10),$AF10-$AE10))+IF(OR($AH10=\"\",$AH10=0),0,(IF(TEXT($AH10,\"[hh]:mm:ss\")<TEXT($AG10,\"[hh]:mm:ss\"),(1-$AG10+$AH10),$AH10-$AG10))+IF(OR($AJ10=\"\",$AJ10=0),0,(IF(TEXT($AJ10,\"[hh]:mm:ss\")<TEXT($AI10,\"[hh]:mm:ss\"),(1-$AI10+$AJ10),$AJ10-$AI10))))))","v":0},null,{"$f":"IF($C10=\"\",0,IF(Q10=\"Sim\",0,IF(TEXT(IF(OR((VLOOKUP($C10,$Z$8:$AB$15,3,FALSE)-$M10)<0,$AE10=\"\"),0,(VLOOKUP($C10,$Z$8:$AB$15,3,FALSE)-$M10)),\"[hh]:mm\")<=TEXT(rngTolerancia,\"[hh]:mm\"),0,IF(OR((VLOOKUP($C10,$Z$8:$AB$15,3,FALSE)-$M10)<0,$AE10=\"\"),0,(VLOOKUP($C10,$Z$8:$AB$15,3,FALSE)-$M10)))))","v":0},null,null,null,0,null,null,null,{"$f":"IF($C10=\"\",0,IF($S10<=VLOOKUP($C10,PREMISSAS!$C$6:$J$13,4,FALSE),$S10,VLOOKUP($C10,PREMISSAS!$C$6:$J$13,4,FALSE)))","v":0},null,{"$f":"IF($C10=\"\",0,IF($S10>VLOOKUP($C10,PREMISSAS!$C$6:$J$13,4,FALSE),$S10-VLOOKUP($C10,PREMISSAS!$C$6:$J$13,4,FALSE),0))","v":0},4,"QUARTA",0.33333333333333331,4,null,{"$f":"IF(OR(F10=\"\",F10=0,F10=\"FALTA\",F10=\"SUSPENSO\",F10=\"SUSPENSÃO\"),\"\",TEXT(F10,\"##\"\":\"\"##\"))","v":""},"","","","","",{"$f":"IF(OR(U10=\"\",U10=0,U10=\"FALTA\",U10=\"SUSPENSO\",U10=\"SUSPENSÃO\"),\"\",TEXT(TEXT(U10,\"00\"\":\"\"00\"),\"[hh]:mm\")*1)","v":""}]
[null,null,4,{"$f":"IF(D10=\"\",\"\",IF((D10+1)>'PERIODOS E FERIADOS'!$G$6,\"\",D10+1))","v":"2023-05-03"},"Quarta",null,null,null,null,null,null,null,0,null,0,null,null,null,0,null,null,null,{"$f":"IF($C11=\"\",0,IF($S11<=VLOOKUP($C11,PREMISSAS!$C$6:$J$13,4,FALSE),$S11,VLOOKUP($C11,PREMISSAS!$C$6:$J$13,4,FALSE)))","v":0},null,{"$f":"IF($C11=\"\",0,IF($S11>VLOOKUP($C11,PREMISSAS!$C$6:$J$13,4,FALSE),$S11-VLOOKUP($C11,PREMISSAS!$C$6:$J$13,4,FALSE),0))","v":0},5,"QUINTA",0.33333333333333331,5,null,"","","","","","",""]
[null,null,5,{"$f":"IF(D11=\"\",\"\",IF((D11+1)>'PERIODOS E FERIADOS'!$G$6,\"\",D11+1))","v":"2023-05-04"},"Quinta",null,null,null,null,null,null,null,0,null,0,null,null,null,0,null,null,null,{"$f":"IF($C12=\"\",0,IF($S12<=VLOOKUP($C12,PREMISSAS!$C$6:$J$13,4,FALSE),$S12,VLOOKUP($C12,PREMISSAS!$C$6:$J$13,4,FALSE)))","v":0},null,{"$f":"IF($C12=\"\",0,IF($S12>VLOOKUP($C12,PREMISSAS!$C$6:$J$13,4,FALSE),$S12-VLOOKUP($C12,PREMISSAS!$C$6:$J$13,4,FALSE),0))","v":0},6,"SEXTA",0.33333333333333331,6,null,"","","","","","",{"$f":"IF(OR(U12=\"\",U12=0,U12=\"FALTA\",U12=\"SUSPENSO\",U12=\"SUSPENSÃO\"),\"\",TEXT(TEXT(U12,\"##\"\":\"\"##\"),\"[hh]:mm\")*1)","v":""}]
[null,null,6,{"$f":"IF(D12=\"\",\"\",IF((D12+1)>'PERIODOS E FERIADOS'!$G$6,\"\",D12+1))","v":"2023-05-05"},"Sexta",null,null,null,null,null,null,null,0,null,0,null,null,null,0,null,null,null,{"$f":"IF($C13=\"\",0,IF($S13<=VLOOKUP($C13,PREMISSAS!$C$6:$J$13,4,FALSE),$S13,VLOOKUP($C13,PREMISSAS!$C$6:$J$13,4,FALSE)))","v":0},null,{"$f":"IF($C13=\"\",0,IF($S13>VLOOKUP($C13,PREMISSAS!$C$6:$J$13,4,FALSE),$S13-VLOOKUP($C13,PREMISSAS!$C$6:$J$13,4,FALSE),0))","v":0},7,"SÁBADO",0.16666666666666666,7,null,"","","","","","",""]
[null,null,7,{"$f":"IF(D13=\"\",\"\",IF((D13+1)>'PERIODOS E FERIADOS'!$G$6,\"\",D13+1))","v":"2023-05-06"},"Sábado",null,null,null,null,null,null,null,0,null,0,null,null,null,0,null,null,null,{"$f":"IF($C14=\"\",0,IF($S14<=VLOOKUP($C14,PREMISSAS!$C$6:$J$13,4,FALSE),$S14,VLOOKUP($C14,PREMISSAS!$C$6:$J$13,4,FALSE)))","v":0},null,{"$f":"IF($C14=\"\",0,IF($S14>VLOOKUP($C14,PREMISSAS!$C$6:$J$13,4,FALSE),$S14-VLOOKUP($C14,PREMISSAS!$C$6:$J$13,4,FALSE),0))","v":0},1,"DOMINGO",0,1,null,"","","","","","",""]
[null,null,1,{"$f":"IF(D14=\"\",\"\",IF((D14+1)>'PERIODOS E FERIADOS'!$G$6,\"\",D14+1))","v":"2023-05-07"},"Domingo",null,null,null,null,null,null,null,0,null,0,null,null,null,0,null,null,null,{"$f":"IF($C15=\"\",0,IF($S15<=VLOOKUP($C15,PREMISSAS!$C$6:$J$13,4,FALSE),$S15,VLOOKUP($C15,PREMISSAS!$C$6:$J$13,4,FALSE)))","v":0},null,{"$f":"IF($C15=\"\",0,IF($S15>VLOOKUP($C15,PREMISSAS!$C$6:$J$13,4,FALSE),$S15-VLOOKUP($C15,PREMISSAS!$C$6:$J$13,4,FALSE),0))","v":0},"F","FERIADOS",0,"F",null,"","","","","","",""]
[null,null,2,{"$f":"IF(D15=\"\",\"\",IF((D15+1)>'PERIODOS E FERIADOS'!$G$6,\"\",D15+1))","v":"2023-05-08"},"Segunda",null,null,null,null,null,null,null,0,null,0,null,null,null,0,null,null,null,{"$f":"IF($C16=\"\",0,IF($S16<=VLOOKUP($C16,PREMISSAS!$C$6:$J$13,4,FALSE),$S16,VLOOKUP($C16,PREMISSAS!$C$6:$J$13,4,FALSE)))","v":0},null,{"$f":"IF($C16=\"\",0,IF($S16>VLOOKUP($C16,PREMISSAS!$C$6:$J$13,4,FALSE),$S16-VLOOKUP($C16,PREMISSAS!$C$6:$J$13,4,FALSE),0))","v":0},null,"TOTAL SEMANA",{"$f":"SUM(AB8:AB15)","v":1.8333333333333333},null,null,"","","","","","",""]
[null,null,3,{"$f":"IF(D16=\"\",\"\",IF((D16+1)>'PERIODOS E FERIADOS'!$G$6,\"\",D16+1))","v":"2023-05-09"},"Terça",null,null,null,null,null,null,null,0,null,0,null,null,null,0,null,null,null,{"$f":"IF($C17=\"\",0,IF($S17<=VLOOKUP($C17,PREMISSAS!$C$6:$J$13,4,FALSE),$S17,VLOOKUP($C17,PREMISSAS!$C$6:$J$13,4,FALSE)))","v":0},null,{"$f":"IF($C17=\"\",0,IF($S17>VLOOKUP($C17,PREMISSAS!$C$6:$J$13,4,FALSE),$S17-VLOOKUP($C17,PREMISSAS!$C$6:$J$13,4,FALSE),0))","v":0},null,"JORNADA MENSAL",{"$f":"AB16*5","v":9.1666666666666661},null,null,"","","","","","",""]
[null,null,4,{"$f":"IF(D17=\"\",\"\",IF((D17+1)>'PERIODOS E FERIADOS'!$G$6,\"\",D17+1))","v":"2023-05-10"},"Quarta",null,null,null,null,null,null,null,0,null,0,null,null,null,0,null,null,null,{"$f":"IF($C18=\"\",0,IF($S18<=VLOOKUP($C18,PREMISSAS!$C$6:$J$13,4,FALSE),$S18,VLOOKUP($C18,PREMISSAS!$C$6:$J$13,4,FALSE)))","v":0},null,{"$f":"IF($C18=\"\",0,IF($S18>VLOOKUP($C18,PREMISSAS!$C$6:$J$13,4,FALSE),$S18-VLOOKUP($C18,PREMISSAS!$C$6:$J$13,4,FALSE),0))","v":0},null,null,null,null,null,"","","","","","",""]
[null,null,5,{"$f":"IF(D18=\"\",\"\",IF((D18+1)>'PERIODOS E FERIADOS'!$G$6,\"\",D18+1))","v":"2023-05-11"},"Quinta",null,null,null,null,null,null,null,0,null,0,null,null,null,0,null,null,null,{"$f":"IF($C19=\"\",0,IF($S19<=VLOOKUP($C19,PREMISSAS!$C$6:$J$13,4,FALSE),$S19,VLOOKUP($C19,PREMISSAS!$C$6:$J$13,4,FALSE)))","v":0},null,{"$f":"IF($C19=\"\",0,IF($S19>VLOOKUP($C19,PREMISSAS!$C$6:$J$13,4,FALSE),$S19-VLOOKUP($C19,PREMISSAS!$C$6:$J$13,4,FALSE),0))","v":0},null,{"$f":"IF(AB$16>AB$23,\"Jornada Superior a permitida\",IF(AB$16<=AB$23,\"\"))","v":""},null,null,null,"","","","","","",""]
[null,null,6,{"$f":"IF(D19=\"\",\"\",IF((D19+1)>'PERIODOS E FERIADOS'!$G$6,\"\",D19+1))","v":"2023-05-12"},"Sexta",null,null,null,null,null,null,null,0,null,0,null,null,null,0,null,null,null,{"$f":"IF($C20=\"\",0,IF($S20<=VLOOKUP($C20,PREMISSAS!$C$6:$J$13,4,FALSE),$S20,VLOOKUP($C20,PREMISSAS!$C$6:$J$13,4,FALSE)))","v":0},null,{"$f":"IF($C20=\"\",0,IF($S20>VLOOKUP($C20,PREMISSAS!$C$6:$J$13,4,FALSE),$S20-VLOOKUP($C20,PREMISSAS!$C$6:$J$13,4,FALSE),0))","v":0},null,{"$f":"IF(AB$16>AB$23,\"\",IF(AB$16<=AB$23,\"Jornada Ok\"))","v":"Jornada Ok"},null,null,null,"","","","","","",""]
[null,null,7,{"$f":"IF(D20=\"\",\"\",IF((D20+1)>'PERIODOS E FERIADOS'!$G$6,\"\",D20+1))","v":"2023-05-13"},"Sábado",null,null,null,null,null,null,null,0,null,0,null,null,null,0,null,null,null,{"$f":"IF($C21=\"\",0,IF($S21<=VLOOKUP($C21,PREMISSAS!$C$6:$J$13,4,FALSE),$S21,VLOOKUP($C21,PREMISSAS!$C$6:$J$13,4,FALSE)))","v":0},null,{"$f":"IF($C21=\"\",0,IF($S21>VLOOKUP($C21,PREMISSAS!$C$6:$J$13,4,FALSE),$S21-VLOOKUP($C21,PREMISSAS!$C$6:$J$13,4,FALSE),0))","v":0},null,null,null,null,null,"","","","","","",""]
[null,null,1,{"$f":"IF(D21=\"\",\"\",IF((D21+1)>'PERIODOS E FERIADOS'!$G$6,\"\",D21+1))","v":"2023-05-14"},"Domingo",null,null,null,null,null,null,null,0,null,0,null,null,null,0,null,null,null,{"$f":"IF($C22=\"\",0,IF($S22<=VLOOKUP($C22,PREMISSAS!$C$6:$J$13,4,FALSE),$S22,VLOOKUP($C22,PREMISSAS!$C$6:$J$13,4,FALSE)))","v":0},null,{"$f":"IF($C22=\"\",0,IF($S22>VLOOKUP($C22,PREMISSAS!$C$6:$J$13,4,FALSE),$S22-VLOOKUP($C22,PREMISSAS!$C$6:$J$13,4,FALSE),0))","v":0},null,null,null,null,null,"","","","","","",""]
[null,null,2,{"$f":"IF(D22=\"\",\"\",IF((D22+1)>'PERIODOS E FERIADOS'!$G$6,\"\",D22+1))","v":"2023-05-15"},"Segunda",null,null,null,null,null,null,null,0,null,0,null,null,null,0,null,null,null,{"$f":"IF($C23=\"\",0,IF($S23<=VLOOKUP($C23,PREMISSAS!$C$6:$J$13,4,FALSE),$S23,VLOOKUP($C23,PREMISSAS!$C$6:$J$13,4,FALSE)))","v":0},null,{"$f":"IF($C23=\"\",0,IF($S23>VLOOKUP($C23,PREMISSAS!$C$6:$J$13,4,FALSE),$S23-VLOOKUP($C23,PREMISSAS!$C$6:$J$13,4,FALSE),0))","v":0},null,"Jornada Maxima",1.8333333333333333,null,null,"","","","","","",""]
[null,null,3,{"$f":"IF(D23=\"\",\"\",IF((D23+1)>'PERIODOS E FERIADOS'!$G$6,\"\",D23+1))","v":"2023-05-16"},"Terça",null,null,null,null,null,null,null,0,null,0,null,null,null,0,null,null,null,{"$f":"IF($C24=\"\",0,IF($S24<=VLOOKUP($C24,PREMISSAS!$C$6:$J$13,4,FALSE),$S24,VLOOKUP($C24,PREMISSAS!$C$6:$J$13,4,FALSE)))","v":0},null,{"$f":"IF($C24=\"\",0,IF($S24>VLOOKUP($C24,PREMISSAS!$C$6:$J$13,4,FALSE),$S24-VLOOKUP($C24,PREMISSAS!$C$6:$J$13,4,FALSE),0))","v":0},null,null,null,null,null,"","","","","","",""]
[null,null,4,{"$f":"IF(D24=\"\",\"\",IF((D24+1)>'PERIODOS E FERIADOS'!$G$6,\"\",D24+1))","v":"2023-05-17"},"Quarta",null,null,null,null,null,null,null,0,null,0,null,null,null,0,null,null,null,{"$f":"IF($C25=\"\",0,IF($S25<=VLOOKUP($C25,PREMISSAS!$C$6:$J$13,4,FALSE),$S25,VLOOKUP($C25,PREMISSAS!$C$6:$J$13,4,FALSE)))","v":0},null,{"$f":"IF($C25=\"\",0,IF($S25>VLOOKUP($C25,PREMISSAS!$C$6:$J$13,4,FALSE),$S25-VLOOKUP($C25,PREMISSAS!$C$6:$J$13,4,FALSE),0))","v":0},null,null,null,null,null,"","","","","","",""]
[null,null,5,{"$f":"IF(D25=\"\",\"\",IF((D25+1)>'PERIODOS E FERIADOS'!$G$6,\"\",D25+1))","v":"2023-05-18"},"Quinta",null,null,null,null,null,null,null,0,null,0,null,null,null,0,null,null,null,{"$f":"IF($C26=\"\",0,IF($S26<=VLOOKUP($C26,PREMISSAS!$C$6:$J$13,4,FALSE),$S26,VLOOKUP($C26,PREMISSAS!$C$6:$J$13,4,FALSE)))","v":0},null,{"$f":"IF($C26=\"\",0,IF($S26>VLOOKUP($C26,PREMISSAS!$C$6:$J$13,4,FALSE),$S26-VLOOKUP($C26,PREMISSAS!$C$6:$J$13,4,FALSE),0))","v":0},null,null,null,null,null,"","","","","","",""]
[null,null,6,{"$f":"IF(D26=\"\",\"\",IF((D26+1)>'PERIODOS E FERIADOS'!$G$6,\"\",D26+1))","v":"2023-05-19"},"Sexta",null,null,null,null,null,null,null,0,null,0,null,null,null,0,null,null,null,{"$f":"IF($C27=\"\",0,IF($S27<=VLOOKUP($C27,PREMISSAS!$C$6:$J$13,4,FALSE),$S27,VLOOKUP($C27,PREMISSAS!$C$6:$J$13,4,FALSE)))","v":0},null,{"$f":"IF($C27=\"\",0,IF($S27>VLOOKUP($C27,PREMISSAS!$C$6:$J$13,4,FALSE),$S27-VLOOKUP($C27,PREMISSAS!$C$6:$J$13,4,FALSE),0))","v":0},null,null,null,null,null,"","","","","","",""]
[null,null,7,{"$f":"IF(D27=\"\",\"\",IF((D27+1)>'PERIODOS E FERIADOS'!$G$6,\"\",D27+1))","v":"2023-05-20"},"Sábado",null,null,null,null,null,null,null,0,null,0,null,null,null,0,null,null,null,{"$f":"IF($C28=\"\",0,IF($S28<=VLOOKUP($C28,PREMISSAS!$C$6:$J$13,4,FALSE),$S28,VLOOKUP($C28,PREMISSAS!$C$6:$J$13,4,FALSE)))","v":0},null,{"$f":"IF($C28=\"\",0,IF($S28>VLOOKUP($C28,PREMISSAS!$C$6:$J$13,4,FALSE),$S28-VLOOKUP($C28,PREMISSAS!$C$6:$J$13,4,FALSE),0))","v":0},null,null,null,null,null,"","","","","","",""]
[null,null,1,{"$f":"IF(D28=\"\",\"\",IF((D28+1)>'PERIODOS E FERIADOS'!$G$6,\"\",D28+1))","v":"2023-05-21"},"Domingo",null,null,null,null,null,null,null,0,null,0,null,null,null,0,null,null,null,{"$f":"IF($C29=\"\",0,IF($S29<=VLOOKUP($C29,PREMISSAS!$C$6:$J$13,4,FALSE),$S29,VLOOKUP($C29,PREMISSAS!$C$6:$J$13,4,FALSE)))","v":0},null,{"$f":"IF($C29=\"\",0,IF($S29>VLOOKUP($C29,PREMISSAS!$C$6:$J$13,4,FALSE),$S29-VLOOKUP($C29,PREMISSAS!$C$6:$J$13,4,FALSE),0))","v":0},null,null,null,null,null,"","","","","","",""]
[null,null,2,{"$f":"IF(D29=\"\",\"\",IF((D29+1)>'PERIODOS E FERIADOS'!$G$6,\"\",D29+1))","v":"2023-05-22"},"Segunda",null,null,null,null,null,null,null,0,null,0,null,null,null,0,null,null,null,{"$f":"IF($C30=\"\",0,IF($S30<=VLOOKUP($C30,PREMISSAS!$C$6:$J$13,4,FALSE),$S30,VLOOKUP($C30,PREMISSAS!$C$6:$J$13,4,FALSE)))","v":0},null,{"$f":"IF($C30=\"\",0,IF($S30>VLOOKUP($C30,PREMISSAS!$C$6:$J$13,4,FALSE),$S30-VLOOKUP($C30,PREMISSAS!$C$6:$J$13,4,FALSE),0))","v":0},null,null,null,null,null,"","","","","","",""]
[null,null,3,{"$f":"IF(D30=\"\",\"\",IF((D30+1)>'PERIODOS E FERIADOS'!$G$6,\"\",D30+1))","v":"2023-05-23"},"Terça",null,null,null,null,null,null,null,0,null,0,null,null,null,0,null,null,null,{"$f":"IF($C31=\"\",0,IF($S31<=VLOOKUP($C31,PREMISSAS!$C$6:$J$13,4,FALSE),$S31,VLOOKUP($C31,PREMISSAS!$C$6:$J$13,4,FALSE)))","v":0},null,{"$f":"IF($C31=\"\",0,IF($S31>VLOOKUP($C31,PREMISSAS!$C$6:$J$13,4,FALSE),$S31-VLOOKUP($C31,PREMISSAS!$C$6:$J$13,4,FALSE),0))","v":0},null,null,null,null,null,"","","","","","",""]
[null,null,4,{"$f":"IF(D31=\"\",\"\",IF((D31+1)>'PERIODOS E FERIADOS'!$G$6,\"\",D31+1))","v":"2023-05-24"},"Quarta",null,null,null,null,null,null,null,0,null,0,null,null,null,0,null,null,null,{"$f":"IF($C32=\"\",0,IF($S32<=VLOOKUP($C32,PREMISSAS!$C$6:$J$13,4,FALSE),$S32,VLOOKUP($C32,PREMISSAS!$C$6:$J$13,4,FALSE)))","v":0},null,{"$f":"IF($C32=\"\",0,IF($S32>VLOOKUP($C32,PREMISSAS!$C$6:$J$13,4,FALSE),$S32-VLOOKUP($C32,PREMISSAS!$C$6:$J$13,4,FALSE),0))","v":0},null,null,null,null,null,{"$f":"IF(OR(F32=\"\",F32=0,F32=\"FALTA\",F32=\"SUSPENSO\",F32=\"SUSPENSÃO\"),\"\",TEXT(F32,\"##\"\":\"\"##\"))","v":""},{"$f":"IF(OR(G32=\"\",G32=0,G32=\"FALTA\",G32=\"SUSPENSO\",G32=\"SUSPENSÃO\"),\"\",TEXT(G32,\"##\"\":\"\"##\"))","v":""},"","",{"$f":"IF(OR(J32=\"\",J32=0,J32=\"FALTA\",J32=\"SUSPENSO\",J32=\"SUSPENSÃO\"),\"\",TEXT(J32,\"##\"\":\"\"##\"))","v":""},{"$f":"IF(OR(K32=\"\",K32=0,K32=\"FALTA\",K32=\"SUSPENSO\",K32=\"SUSPENSÃO\"),\"\",TEXT(K32,\"##\"\":\"\"##\"))","v":""},""]
[null,null,5,{"$f":"IF(D32=\"\",\"\",IF((D32+1)>'PERIODOS E FERIADOS'!$G$6,\"\",D32+1))","v":"2023-05-25"},"Quinta",null,null,null,null,null,null,null,0,null,0,null,null,null,0,null,null,null,{"$f":"IF($C33=\"\",0,IF($S33<=VLOOKUP($C33,PREMISSAS!$C$6:$J$13,4,FALSE),$S33,VLOOKUP($C33,PREMISSAS!$C$6:$J$13,4,FALSE)))","v":0},null,{"$f":"IF($C33=\"\",0,IF($S33>VLOOKUP($C33,PREMISSAS!$C$6:$J$13,4,FALSE),$S33-VLOOKUP($C33,PREMISSAS!$C$6:$J$13,4,FALSE),0))","v":0},null,null,null,null,null,{"$f":"IF(OR(F33=\"\",F33=0,F33=\"FALTA\",F33=\"SUSPENSO\",F33=\"SUSPENSÃO\"),\"\",TEXT(F33,\"##\"\":\"\"##\"))","v":""},"","","","","",""]
[null,null,6,{"$f":"IF(D33=\"\",\"\",IF((D33+1)>'PERIODOS E FERIADOS'!$G$6,\"\",D33+1))","v":"2023-05-26"},"Sexta",null,null,null,null,null,null,null,0,null,0,null,null,null,0,null,null,null,{"$f":"IF($C34=\"\",0,IF($S34<=VLOOKUP($C34,PREMISSAS!$C$6:$J$13,4,FALSE),$S34,VLOOKUP($C34,PREMISSAS!$C$6:$J$13,4,FALSE)))","v":0},null,{"$f":"IF($C34=\"\",0,IF($S34>VLOOKUP($C34,PREMISSAS!$C$6:$J$13,4,FALSE),$S34-VLOOKUP($C34,PREMISSAS!$C$6:$J$13,4,FALSE),0))","v":0},null,null,null,null,null,"","","","","","",""]
[null,null,7,{"$f":"IF(D34=\"\",\"\",IF((D34+1)>'PERIODOS E FERIADOS'!$G$6,\"\",D34+1))","v":"2023-05-27"},"Sábado",null,null,null,null,null,null,null,0,null,0,null,null,null,0,null,null,null,{"$f":"IF($C35=\"\",0,IF($S35<=VLOOKUP($C35,PREMISSAS!$C$6:$J$13,4,FALSE),$S35,VLOOKUP($C35,PREMISSAS!$C$6:$J$13,4,FALSE)))","v":0},null,{"$f":"IF($C35=\"\",0,IF($S35>VLOOKUP($C35,PREMISSAS!$C$6:$J$13,4,FALSE),$S35-VLOOKUP($C35,PREMISSAS!$C$6:$J$13,4,FALSE),0))","v":0},null,null,null,null,null,"","","","","","",""]
[null,null,1,{"$f":"IF(D35=\"\",\"\",IF((D35+1)>'PERIODOS E FERIADOS'!$G$6,\"\",D35+1))","v":"2023-05-28"},"Domingo",null,null,null,null,null,null,null,0,null,0,null,null,null,0,null,null,null,{"$f":"IF($C36=\"\",0,IF($S36<=VLOOKUP($C36,PREMISSAS!$C$6:$J$13,4,FALSE),$S36,VLOOKUP($C36,PREMISSAS!$C$6:$J$13,4,FALSE)))","v":0},null,{"$f":"IF($C36=\"\",0,IF($S36>VLOOKUP($C36,PREMISSAS!$C$6:$J$13,4,FALSE),$S36-VLOOKUP($C36,PREMISSAS!$C$6:$J$13,4,FALSE),0))","v":0},null,null,null,null,null,"","","","","","",""]
[null,null,2,{"$f":"IF(D36=\"\",\"\",IF((D36+1)>'PERIODOS E FERIADOS'!$G$6,\"\",D36+1))","v":"2023-05-29"},"Segunda",null,null,null,null,null,null,null,0,null,0,null,null,null,0,null,null,null,{"$f":"IF($C37=\"\",0,IF($S37<=VLOOKUP($C37,PREMISSAS!$C$6:$J$13,4,FALSE),$S37,VLOOKUP($C37,PREMISSAS!$C$6:$J$13,4,FALSE)))","v":0},null,{"$f":"IF($C37=\"\",0,IF($S37>VLOOKUP($C37,PREMISSAS!$C$6:$J$13,4,FALSE),$S37-VLOOKUP($C37,PREMISSAS!$C$6:$J$13,4,FALSE),0))","v":0},null,null,null,null,null,"","","","","","",""]
[null,null,3,{"$f":"IF(D37=\"\",\"\",IF((D37+1)>'PERIODOS E FERIADOS'!$G$6,\"\",D37+1))","v":"2023-05-30"},"Terça",null,null,null,null,null,null,null,0,null,0,null,null,null,0,null,null,null,{"$f":"IF($C38=\"\",0,IF($S38<=VLOOKUP($C38,PREMISSAS!$C$6:$J$13,4,FALSE),$S38,VLOOKUP($C38,PREMISSAS!$C$6:$J$13,4,FALSE)))","v":0},null,{"$f":"IF($C38=\"\",0,IF($S38>VLOOKUP($C38,PREMISSAS!$C$6:$J$13,4,FALSE),$S38-VLOOKUP($C38,PREMISSAS!$C$6:$J$13,4,FALSE),0))","v":0},null,null,null,null,null,"","","","","","",""]
[null,null,4,{"$f":"IF(D38=\"\",\"\",IF((D38+1)>'PERIODOS E FERIADOS'!$G$6,\"\",D38+1))","v":"2023-05-31"},"Quarta",null,null,null,null,null,null,null,0,null,0,null,null,null,0,null,null,null,{"$f":"IF($C39=\"\",0,IF($S39<=VLOOKUP($C39,PREMISSAS!$C$6:$J$13,4,FALSE),$S39,VLOOKUP($C39,PREMISSAS!$C$6:$J$13,4,FALSE)))","v":0},null,{"$f":"IF($C39=\"\",0,IF($S39>VLOOKUP($C39,PREMISSAS!$C$6:$J$13,4,FALSE),$S39-VLOOKUP($C39,PREMISSAS!$C$6:$J$13,4,FALSE),0))","v":0},null,null,null,null,null,"","","","","","",""]
[]
[null,null,null,"TOTAIS",null,null,"Faltas / Suspensão",null,{"$f":"COUNTIF($F$9:$F$39,\"FALTA\")+COUNTIF($F$9:$F$39,\"SUSPENSÃO\")+COUNTIF($F$9:$F$39,\"SUSPENSO\")+COUNTIF($F$9:$F$39,\"SUSPENSAO\")","v":0},null,null,null,{"$f":"SUM($M$9:$M$39)","v":0},null,{"$f":"SUM($O$9:$O$39)","v":0},null,null,null,{"$f":"SUM(S$9:S$39)","v":0},null,{"$f":"$AK$41","v":0},null,{"$f":"SUM(W$9:W$39)","v":0},null,{"$f":"SUM(Y$9:Y$39)","v":0},null,null,null,null,null,null,null,null,null,null,null,{"$f":"SUM(AK9:AK39)","v":0}]
[]
[null,null,null,"OBSERVAÇÕES:"]

{"sheet":"FUNC 3","index":7,"n_rows":43,"n_cols":37,"rows_kept":43,"cut":false,"hidden":false,"merged":[[5,30,5,33],[40,3,40,5],[40,6,40,7],[40,8,40,10],[42,3,43,24],[18,26,18,27],[19,26,19,27],[3,3,4,27],[5,3,5,4],[5,5,5,10],[5,12,5,20],[5,22,5,24],[5,26,5,27]]}
[]
[]
[]
[null,null,null,{"$f":"'PERIODOS E FERIADOS'!$E$5","v":0}]
[]
[null,null,null,"Funcionário",null,{"$f":"FUNCIONÁRIOS!E7","v":3},null,null,null,null,null,null,"H.E. / Atrasos / A.N",null,null,null,null,null,null,null,null,null,"Distrib. H.E. p/ Faixa",null,null,null,"CARGA HORÁRIA",null,null,null,"ESPELHO"]
[]
[null,null,null,"Data","Dia Semana","Entrada","Saída","Entrada","Saída","Entrada","Saída",null,"H. Diária",null,"Atrasos",null,"Abona",null,"Horas Extras",null,"Adc. Noturno",null,{"$f":"PREMISSAS!H6","v":0.5},null,{"$f":"PREMISSAS!H12","v":1},2,"SEGUNDA",0.33333333333333331,2,null,"Entrada","Saída","Entrada","Saída","Entrada","Saída","AN "]
[null,null,{"$f":"IF(NOT(ISERROR(VLOOKUP(D9,rngFeriados,1,FALSE))),\"F\",IF(D9=\"\",\"\",WEEKDAY($D9,1)))","v":"F"},{"$f":"'PERIODOS E FERIADOS'!$E$6","v":"2023-05-01"},{"$f":"IF(D9=\"\",\"\",IF(WEEKDAY(D9,1)=1,\"Domingo\",IF(WEEKDAY(D9,1)=2,\"Segunda\",IF(WEEKDAY(D9,1)=3,\"Terça\",IF(WEEKDAY(D9,1)=4,\"Quarta\",IF(WEEKDAY(D9,1)=5,\"Quinta\",IF(WEEKDAY(D9,1)=6,\"Sexta\",IF(WEEKDAY(D9,1)=7,\"Sábado\"))))))))","v":"Segunda"},null,null,null,null,null,null,null,{"$f":"IF(ISERROR(IF(OR($AF9=\"\",$AF9=0),0,(IF(TEXT($AF9,\"[hh]:mm:ss\")<TEXT($AE9,\"[hh]:mm:ss\"),(1-$AE9+$AF9),$AF9-$AE9))+IF(OR($AH9=\"\",$AH9=0),0,(IF(TEXT($AH9,\"[hh]:mm:ss\")<TEXT($AG9,\"[hh]:mm:ss\"),(1-$AG9+$AH9),$AH9-$AG9))+IF(OR($AJ9=\"\",$AJ9=0),0,(IF(TEXT($AJ9,\"[hh]:mm:ss\")<TEXT($AI9,\"[hh]:mm:ss\"),(1-$AI9+$AJ9),$AJ9-$AI9)))))),0,IF(OR($AF9=\"\",$AF9=0),0,(IF(TEXT($AF9,\"[hh]:mm:ss\")<TEXT($AE9,\"[hh]:mm:ss\"),(1-$AE9+$AF9),$AF9-$AE9))+IF(OR($AH9=\"\",$AH9=0),0,(IF(TEXT($AH9,\"[hh]:mm:ss\")<TEXT($AG9,\"[hh]:mm:ss\"),(1-$AG9+$AH9),$AH9-$AG9))+IF(OR($AJ9=\"\",$AJ9=0),0,(IF(TEXT($AJ9,\"[hh]:mm:ss\")<TEXT($AI9,\"[hh]:mm:ss\"),(1-$AI9+$AJ9),$AJ9-$AI9))))))","v":0},null,{"$f":"IF($C9=\"\",0,IF(Q9=\"Sim\",0,IF(TEXT(IF(OR((VLOOKUP($C9,$Z$8:$AB$15,3,FALSE)-$M9)<0,$AE9=\"\"),0,(VLOOKUP($C9,$Z$8:$AB$15,3,FALSE)-$M9)),\"[hh]:mm\")<=TEXT(rngTolerancia,\"[hh]:mm\"),0,IF(OR((VLOOKUP($C9,$Z$8:$AB$15,3,FALSE)-$M9)<0,$AE9=\"\"),0,(VLOOKUP($C9,$Z$8:$AB$15,3,FALSE)-$M9)))))","v":0},null,null,null,{"$f":"IF($C9=\"\",0,IF(TEXT(IF(($M9-VLOOKUP($C9,$Z$8:$AB$15,3,FALSE))<0,0,($M9-VLOOKUP($C9,$Z$8:$AB$15,3,FALSE))),\"[hh]:mm\")<=TEXT(rngTolerancia,\"[hh]:mm\"),0,IF(($M9-VLOOKUP($C9,$Z$8:$AB$15,3,FALSE))<0,0,($M9-VLOOKUP($C9,$Z$8:$AB$15,3,FALSE)))))","v":0},null,null,null,{"$f":"IF($C9=\"\",0,IF($S9<=VLOOKUP($C9,PREMISSAS!$C$6:$J$13,4,FALSE),$S9,VLOOKUP($C9,PREMISSAS!$C$6:$J$13,4,FALSE)))","v":0},null,{"$f":"IF($C9=\"\",0,IF($S9>VLOOKUP($C9,PREMISSAS!$C$6:$J$13,4,FALSE),$S9-VLOOKUP($C9,PREMISSAS!$C$6:$J$13,4,FALSE),0))","v":0},3,"TERÇA",0.33333333333333331,3,null,{"$f":"IF(OR(F9=\"\",F9=0,F9=\"FALTA\",F9=\"SUSPENSO\",F9=\"SUSPENSÃO\"),\"\",TEXT(F9,\"##\"\":\"\"##\"))","v":""},{"$f":"IF(OR(G9=\"\",G9=0,G9=\"FALTA\",G9=\"SUSPENSO\",G9=\"SUSPENSÃO\"),\"\",TEXT(G9,\"##\"\":\"\"##\"))","v":""},"","",{"$f":"IF(OR(J9=\"\",J9=0,J9=\"FALTA\",J9=\"SUSPENSO\",J9=\"SUSPENSÃO\"),\"\",TEXT(J9,\"##\"\":\"\"##\"))","v":""},{"$f":"IF(OR(K9=\"\",K9=0,K9=\"FALTA\",K9=\"SUSPENSO\",K9=\"SUSPENSÃO\"),\"\",TEXT(K9,\"##\"\":\"\"##\"))","v":""},{"$f":"IF(OR(U9=\"\",U9=0,U9=\"FALTA\",U9=\"SUSPENSO\",U9=\"SUSPENSÃO\"),\"\",TEXT(TEXT(U9,\"00\"\":\"\"00\"),\"[hh]:mm\")*1)","v":""}]
[null,null,3,{"$f":"IF(D9=\"\",\"\",IF((D9+1)>'PERIODOS E FERIADOS'!$G$6,\"\",D9+1))","v":"2023-05-02"},{"$f":"IF(D10=\"\",\"\",IF(WEEKDAY(D10,1)=1,\"Domingo\",IF(WEEKDAY(D10,1)=2,\"Segunda\",IF(WEEKDAY(D10,1)=3,\"Terça\",IF(WEEKDAY(D10,1)=4,\"Quarta\",IF(WEEKDAY(D10,1)=5,\"Quinta\",IF(WEEKDAY(D10,1)=6,\"Sexta\",IF(WEEKDAY(D10,1)=7,\"Sábado\"))))))))","v":"Terça"},null,null,null,null,null,null,null,{"$f":"IF(ISERROR(IF(OR($AF10=\"\",$AF10=0),0,(IF(TEXT($AF10,\"[hh]:mm:ss\")<TEXT($AE10,\"[hh]:mm:ss\"),(1-$AE10+$AF10),$AF10-$AE10))+IF(OR($AH10=\"\",$AH10=0),0,(IF(TEXT($AH10,\"[hh]:mm:ss\")<TEXT($AG10,\"[hh]:mm:ss\"),(1-$AG10+$AH10),$AH10-$AG10))+IF(OR($AJ10=\"\",$AJ10=0),0,(IF(TEXT($AJ10,\"[hh]:mm:ss\")<TEXT($AI10,\"[hh]:mm:ss\"),(1-$AI10+$AJ10),$AJ10-$AI10)))))),0,IF(OR($AF10=\"\",$AF10=0),0,(IF(TEXT($AF10,\"[hh]:mm:ss\")<TEXT($AE10,\"[hh]:mm:ss\"),(1-$AE10+$AF10),$AF10-$AE10))+IF(OR($AH10=\"\",$AH10=0),0,(IF(TEXT($AH10,\"[hh]:mm:ss\")<TEXT($AG10,\"[hh]:mm:ss\"),(1-$AG10+$AH10),$AH10-$AG10))+IF(OR($AJ10=\"\",$AJ10=0),0,(IF(TEXT($AJ10,\"[hh]:mm:ss\")<TEXT($AI10,\"[hh]:mm:ss\"),(1-$AI10+$AJ10),$AJ10-$AI10))))))","v":0},null,{"$f":"IF($C10=\"\",0,IF(Q10=\"Sim\",0,IF(TEXT(IF(OR((VLOOKUP($C10,$Z$8:$AB$15,3,FALSE)-$M10)<0,$AE10=\"\"),0,(VLOOKUP($C10,$Z$8:$AB$15,3,FALSE)-$M10)),\"[hh]:mm\")<=TEXT(rngTolerancia,\"[hh]:mm\"),0,IF(OR((VLOOKUP($C10,$Z$8:$AB$15,3,FALSE)-$M10)<0,$AE10=\"\"),0,(VLOOKUP($C10,$Z$8:$AB$15,3,FALSE)-$M10)))))","v":0},null,null,null,0,null,null,null,{"$f":"IF($C10=\"\",0,IF($S10<=VLOOKUP($C10,PREMISSAS!$C$6:$J$13,4,FALSE),$S10,VLOOKUP($C10,PREMISSAS!$C$6:$J$13,4,FALSE)))","v":0},null,{"$f":"IF($C10=\"\",0,IF($S10>VLOOKUP($C10,PREMISSAS!$C$6:$J$13,4,FALSE),$S10-VLOOKUP($C10,PREMISSAS!$C$6:$J$13,4,FALSE),0))","v":0},4,"QUARTA",0.33333333333333331,4,null,{"$f":"IF(OR(F10=\"\",F10=0,F10=\"FALTA\",F10=\"SUSPENSO\",F10=\"SUSPENSÃO\"),\"\",TEXT(F10,\"##\"\":\"\"##\"))","v":""},"","","","","",{"$f":"IF(OR(U10=\"\",U10=0,U10=\"FALTA\",U10=\"SUSPENSO\",U10=\"SUSPENSÃO\"),\"\",TEXT(TEXT(U10,\"00\"\":\"\"00\"),\"[hh]:mm\")*1)","v":""}]
[null,null,4,{"$f":"IF(D10=\"\",\"\",IF((D10+1)>'PERIODOS E FERIADOS'!$G$6,\"\",D10+1))","v":"2023-05-03"},"Quarta",null,null,null,null,null,null,null,0,null,0,null,null,null,0,null,null,null,{"$f":"IF($C11=\"\",0,IF($S11<=VLOOKUP($C11,PREMISSAS!$C$6:$J$13,4,FALSE),$S11,VLOOKUP($C11,PREMISSAS!$C$6:$J$13,4,FALSE)))","v":0},null,{"$f":"IF($C11=\"\",0,IF($S11>VLOOKUP($C11,PREMISSAS!$C$6:$J$13,4,FALSE),$S11-VLOOKUP($C11,PREMISSAS!$C$6:$J$13,4,FALSE),0))","v":0},5,"QUINTA",0.33333333333333331,5,null,"","","","","","",""]
[null,null,5,{"$f":"IF(D11=\"\",\"\",IF((D11+1)>'PERIODOS E FERIADOS'!$G$6,\"\",D11+1))","v":"2023-05-04"},"Quinta",null,null,null,null,null,null,null,0,null,0,null,null,null,0,null,null,null,{"$f":"IF($C12=\"\",0,IF($S12<=VLOOKUP($C12,PREMISSAS!$C$6:$J$13,4,FALSE),$S12,VLOOKUP($C12,PREMISSAS!$C$6:$J$13,4,FALSE)))","v":0},null,{"$f":"IF($C12=\"\",0,IF($S12>VLOOKUP($C12,PREMISSAS!$C$6:$J$13,4,FALSE),$S12-VLOOKUP($C12,PREMISSAS!$C$6:$J$13,4,FALSE),0))","v":0},6,"SEXTA",0.33333333333333331,6,null,"","","","","","",{"$f":"IF(OR(U12=\"\",U12=0,U12=\"FALTA\",U12=\"SUSPENSO\",U12=\"SUSPENSÃO\"),\"\",TEXT(TEXT(U12,\"##\"\":\"\"##\"),\"[hh]:mm\")*1)","v":""}]
[null,null,6,{"$f":"IF(D12=\"\",\"\",IF((D12+1)>'PERIODOS E FERIADOS'!$G$6,\"\",D12+1))","v":"2023-05-05"},"Sexta",null,null,null,null,null,null,null,0,null,0,null,null,null,0,null,null,null,{"$f":"IF($C13=\"\",0,IF($S13<=VLOOKUP($C13,PREMISSAS!$C$6:$J$13,4,FALSE),$S13,VLOOKUP($C13,PREMISSAS!$C$6:$J$13,4,FALSE)))","v":0},null,{"$f":"IF($C13=\"\",0,IF($S13>VLOOKUP($C13,PREMISSAS!$C$6:$J$13,4,FALSE),$S13-VLOOKUP($C13,PREMISSAS!$C$6:$J$13,4,FALSE),0))","v":0},7,"SÁBADO",0.16666666666666666,7,null,"","","","","","",""]
[null,null,7,{"$f":"IF(D13=\"\",\"\",IF((D13+1)>'PERIODOS E FERIADOS'!$G$6,\"\",D13+1))","v":"2023-05-06"},"Sábado",null,null,null,null,null,null,null,0,null,0,null,null,null,0,null,null,null,{"$f":"IF($C14=\"\",0,IF($S14<=VLOOKUP($C14,PREMISSAS!$C$6:$J$13,4,FALSE),$S14,VLOOKUP($C14,PREMISSAS!$C$6:$J$13,4,FALSE)))","v":0},null,{"$f":"IF($C14=\"\",0,IF($S14>VLOOKUP($C14,PREMISSAS!$C$6:$J$13,4,FALSE),$S14-VLOOKUP($C14,PREMISSAS!$C$6:$J$13,4,FALSE),0))","v":0},1,"DOMINGO",0,1,null,"","","","","","",""]
[null,null,1,{"$f":"IF(D14=\"\",\"\",IF((D14+1)>'PERIODOS E FERIADOS'!$G$6,\"\",D14+1))","v":"2023-05-07"},"Domingo",null,null,null,null,null,null,null,0,null,0,null,null,null,0,null,null,null,{"$f":"IF($C15=\"\",0,IF($S15<=VLOOKUP($C15,PREMISSAS!$C$6:$J$13,4,FALSE),$S15,VLOOKUP($C15,PREMISSAS!$C$6:$J$13,4,FALSE)))","v":0},null,{"$f":"IF($C15=\"\",0,IF($S15>VLOOKUP($C15,PREMISSAS!$C$6:$J$13,4,FALSE),$S15-VLOOKUP($C15,PREMISSAS!$C$6:$J$13,4,FALSE),0))","v":0},"F","FERIADOS",0,"F",null,"","","","","","",""]
[null,null,2,{"$f":"IF(D15=\"\",\"\",IF((D15+1)>'PERIODOS E FERIADOS'!$G$6,\"\",D15+1))","v":"2023-05-08"},"Segunda",null,null,null,null,null,null,null,0,null,0,null,null,null,0,null,null,null,{"$f":"IF($C16=\"\",0,IF($S16<=VLOOKUP($C16,PREMISSAS!$C$6:$J$13,4,FALSE),$S16,VLOOKUP($C16,PREMISSAS!$C$6:$J$13,4,FALSE)))","v":0},null,{"$f":"IF($C16=\"\",0,IF($S16>VLOOKUP($C16,PREMISSAS!$C$6:$J$13,4,FALSE),$S16-VLOOKUP($C16,PREMISSAS!$C$6:$J$13,4,FALSE),0))","v":0},null,"TOTAL SEMANA",{"$f":"SUM(AB8:AB15)","v":1.8333333333333333},null,null,"","","","","","",""]
[null,null,3,{"$f":"IF(D16=\"\",\"\",IF((D16+1)>'PERIODOS E FERIADOS'!$G$6,\"\",D16+1))","v":"2023-05-09"},"Terça",null,null,null,null,null,null,null,0,null,0,null,null,null,0,null,null,null,{"$f":"IF($C17=\"\",0,IF($S17<=VLOOKUP($C17,PREMISSAS!$C$6:$J$13,4,FALSE),$S17,VLOOKUP($C17,PREMISSAS!$C$6:$J$13,4,FALSE)))","v":0},null,{"$f":"IF($C17=\"\",0,IF($S17>VLOOKUP($C17,PREMISSAS!$C$6:$J$13,4,FALSE),$S17-VLOOKUP($C17,PREMISSAS!$C$6:$J$13,4,FALSE),0))","v":0},null,"JORNADA MENSAL",{"$f":"AB16*5","v":9.1666666666666661},null,null,"","","","","","",""]
[null,null,4,{"$f":"IF(D17=\"\",\"\",IF((D17+1)>'PERIODOS E FERIADOS'!$G$6,\"\",D17+1))","v":"2023-05-10"},"Quarta",null,null,null,null,null,null,null,0,null,0,null,null,null,0,null,null,null,{"$f":"IF($C18=\"\",0,IF($S18<=VLOOKUP($C18,PREMISSAS!$C$6:$J$13,4,FALSE),$S18,VLOOKUP($C18,PREMISSAS!$C$6:$J$13,4,FALSE)))","v":0},null,{"$f":"IF($C18=\"\",0,IF($S18>VLOOKUP($C18,PREMISSAS!$C$6:$J$13,4,FALSE),$S18-VLOOKUP($C18,PREMISSAS!$C$6:$J$13,4,FALSE),0))","v":0},null,null,null,null,null,"","","","","","",""]
[null,null,5,{"$f":"IF(D18=\"\",\"\",IF((D18+1)>'PERIODOS E FERIADOS'!$G$6,\"\",D18+1))","v":"2023-05-11"},"Quinta",null,null,null,null,null,null,null,0,null,0,null,null,null,0,null,null,null,{"$f":"IF($C19=\"\",0,IF($S19<=VLOOKUP($C19,PREMISSAS!$C$6:$J$13,4,FALSE),$S19,VLOOKUP($C19,PREMISSAS!$C$6:$J$13,4,FALSE)))","v":0},null,{"$f":"IF($C19=\"\",0,IF($S19>VLOOKUP($C19,PREMISSAS!$C$6:$J$13,4,FALSE),$S19-VLOOKUP($C19,PREMISSAS!$C$6:$J$13,4,FALSE),0))","v":0},null,{"$f":"IF(AB$16>AB$23,\"Jornada Superior a permitida\",IF(AB$16<=AB$23,\"\"))","v":""},null,null,null,"","","","","","",""]
[null,null,6,{"$f":"IF(D19=\"\",\"\",IF((D19+1)>'PERIODOS E FERIADOS'!$G$6,\"\",D19+1))","v":"2023-05-12"},"Sexta",null,null,null,null,null,null,null,0,null,0,null,null,null,0,null,null,null,{"$f":"IF($C20=\"\",0,IF($S20<=VLOOKUP($C20,PREMISSAS!$C$6:$J$13,4,FALSE),$S20,VLOOKUP($C20,PREMISSAS!$C$6:$J$13,4,FALSE)))","v":0},null,{"$f":"IF($C20=\"\",0,IF($S20>VLOOKUP($C20,PREMISSAS!$C$6:$J$13,4,FALSE),$S20-VLOOKUP($C20,PREMISSAS!$C$6:$J$13,4,FALSE),0))","v":0},null,{"$f":"IF(AB$16>AB$23,\"\",IF(AB$16<=AB$23,\"Jornada Ok\"))","v":"Jornada Ok"},null,null,null,"","","","","","",""]
[null,null,7,{"$f":"IF(D20=\"\",\"\",IF((D20+1)>'PERIODOS E FERIADOS'!$G$6,\"\",D20+1))","v":"2023-05-13"},"Sábado",null,null,null,null,null,null,null,0,null,0,null,null,null,0,null,null,null,{"$f":"IF($C21=\"\",0,IF($S21<=VLOOKUP($C21,PREMISSAS!$C$6:$J$13,4,FALSE),$S21,VLOOKUP($C21,PREMISSAS!$C$6:$J$13,4,FALSE)))","v":0},null,{"$f":"IF($C21=\"\",0,IF($S21>VLOOKUP($C21,PREMISSAS!$C$6:$J$13,4,FALSE),$S21-VLOOKUP($C21,PREMISSAS!$C$6:$J$13,4,FALSE),0))","v":0},null,null,null,null,null,"","","","","","",""]
[null,null,1,{"$f":"IF(D21=\"\",\"\",IF((D21+1)>'PERIODOS E FERIADOS'!$G$6,\"\",D21+1))","v":"2023-05-14"},"Domingo",null,null,null,null,null,null,null,0,null,0,null,null,null,0,null,null,null,{"$f":"IF($C22=\"\",0,IF($S22<=VLOOKUP($C22,PREMISSAS!$C$6:$J$13,4,FALSE),$S22,VLOOKUP($C22,PREMISSAS!$C$6:$J$13,4,FALSE)))","v":0},null,{"$f":"IF($C22=\"\",0,IF($S22>VLOOKUP($C22,PREMISSAS!$C$6:$J$13,4,FALSE),$S22-VLOOKUP($C22,PREMISSAS!$C$6:$J$13,4,FALSE),0))","v":0},null,null,null,null,null,"","","","","","",""]
[null,null,2,{"$f":"IF(D22=\"\",\"\",IF((D22+1)>'PERIODOS E FERIADOS'!$G$6,\"\",D22+1))","v":"2023-05-15"},"Segunda",null,null,null,null,null,null,null,0,null,0,null,null,null,0,null,null,null,{"$f":"IF($C23=\"\",0,IF($S23<=VLOOKUP($C23,PREMISSAS!$C$6:$J$13,4,FALSE),$S23,VLOOKUP($C23,PREMISSAS!$C$6:$J$13,4,FALSE)))","v":0},null,{"$f":"IF($C23=\"\",0,IF($S23>VLOOKUP($C23,PREMISSAS!$C$6:$J$13,4,FALSE),$S23-VLOOKUP($C23,PREMISSAS!$C$6:$J$13,4,FALSE),0))","v":0},null,"Jornada Maxima",1.8333333333333333,null,null,"","","","","","",""]
[null,null,3,{"$f":"IF(D23=\"\",\"\",IF((D23+1)>'PERIODOS E FERIADOS'!$G$6,\"\",D23+1))","v":"2023-05-16"},"Terça",null,null,null,null,null,null,null,0,null,0,null,null,null,0,null,null,null,{"$f":"IF($C24=\"\",0,IF($S24<=VLOOKUP($C24,PREMISSAS!$C$6:$J$13,4,FALSE),$S24,VLOOKUP($C24,PREMISSAS!$C$6:$J$13,4,FALSE)))","v":0},null,{"$f":"IF($C24=\"\",0,IF($S24>VLOOKUP($C24,PREMISSAS!$C$6:$J$13,4,FALSE),$S24-VLOOKUP($C24,PREMISSAS!$C$6:$J$13,4,FALSE),0))","v":0},null,null,null,null,null,"","","","","","",""]
[null,null,4,{"$f":"IF(D24=\"\",\"\",IF((D24+1)>'PERIODOS E FERIADOS'!$G$6,\"\",D24+1))","v":"2023-05-17"},"Quarta",null,null,null,null,null,null,null,0,null,0,null,null,null,0,null,null,null,{"$f":"IF($C25=\"\",0,IF($S25<=VLOOKUP($C25,PREMISSAS!$C$6:$J$13,4,FALSE),$S25,VLOOKUP($C25,PREMISSAS!$C$6:$J$13,4,FALSE)))","v":0},null,{"$f":"IF($C25=\"\",0,IF($S25>VLOOKUP($C25,PREMISSAS!$C$6:$J$13,4,FALSE),$S25-VLOOKUP($C25,PREMISSAS!$C$6:$J$13,4,FALSE),0))","v":0},null,null,null,null,null,"","","","","","",""]
[null,null,5,{"$f":"IF(D25=\"\",\"\",IF((D25+1)>'PERIODOS E FERIADOS'!$G$6,\"\",D25+1))","v":"2023-05-18"},"Quinta",null,null,null,null,null,null,null,0,null,0,null,null,null,0,null,null,null,{"$f":"IF($C26=\"\",0,IF($S26<=VLOOKUP($C26,PREMISSAS!$C$6:$J$13,4,FALSE),$S26,VLOOKUP($C26,PREMISSAS!$C$6:$J$13,4,FALSE)))","v":0},null,{"$f":"IF($C26=\"\",0,IF($S26>VLOOKUP($C26,PREMISSAS!$C$6:$J$13,4,FALSE),$S26-VLOOKUP($C26,PREMISSAS!$C$6:$J$13,4,FALSE),0))","v":0},null,null,null,null,null,"","","","","","",""]
[null,null,6,{"$f":"IF(D26=\"\",\"\",IF((D26+1)>'PERIODOS E FERIADOS'!$G$6,\"\",D26+1))","v":"2023-05-19"},"Sexta",null,null,null,null,null,null,null,0,null,0,null,null,null,0,null,null,null,{"$f":"IF($C27=\"\",0,IF($S27<=VLOOKUP($C27,PREMISSAS!$C$6:$J$13,4,FALSE),$S27,VLOOKUP($C27,PREMISSAS!$C$6:$J$13,4,FALSE)))","v":0},null,{"$f":"IF($C27=\"\",0,IF($S27>VLOOKUP($C27,PREMISSAS!$C$6:$J$13,4,FALSE),$S27-VLOOKUP($C27,PREMISSAS!$C$6:$J$13,4,FALSE),0))","v":0},null,null,null,null,null,"","","","","","",""]
[null,null,7,{"$f":"IF(D27=\"\",\"\",IF((D27+1)>'PERIODOS E FERIADOS'!$G$6,\"\",D27+1))","v":"2023-05-20"},"Sábado",null,null,null,null,null,null,null,0,null,0,null,null,null,0,null,null,null,{"$f":"IF($C28=\"\",0,IF($S28<=VLOOKUP($C28,PREMISSAS!$C$6:$J$13,4,FALSE),$S28,VLOOKUP($C28,PREMISSAS!$C$6:$J$13,4,FALSE)))","v":0},null,{"$f":"IF($C28=\"\",0,IF($S28>VLOOKUP($C28,PREMISSAS!$C$6:$J$13,4,FALSE),$S28-VLOOKUP($C28,PREMISSAS!$C$6:$J$13,4,FALSE),0))","v":0},null,null,null,null,null,"","","","","","",""]
[null,null,1,{"$f":"IF(D28=\"\",\"\",IF((D28+1)>'PERIODOS E FERIADOS'!$G$6,\"\",D28+1))","v":"2023-05-21"},"Domingo",null,null,null,null,null,null,null,0,null,0,null,null,null,0,null,null,null,{"$f":"IF($C29=\"\",0,IF($S29<=VLOOKUP($C29,PREMISSAS!$C$6:$J$13,4,FALSE),$S29,VLOOKUP($C29,PREMISSAS!$C$6:$J$13,4,FALSE)))","v":0},null,{"$f":"IF($C29=\"\",0,IF($S29>VLOOKUP($C29,PREMISSAS!$C$6:$J$13,4,FALSE),$S29-VLOOKUP($C29,PREMISSAS!$C$6:$J$13,4,FALSE),0))","v":0},null,null,null,null,null,"","","","","","",""]
[null,null,2,{"$f":"IF(D29=\"\",\"\",IF((D29+1)>'PERIODOS E FERIADOS'!$G$6,\"\",D29+1))","v":"2023-05-22"},"Segunda",null,null,null,null,null,null,null,0,null,0,null,null,null,0,null,null,null,{"$f":"IF($C30=\"\",0,IF($S30<=VLOOKUP($C30,PREMISSAS!$C$6:$J$13,4,FALSE),$S30,VLOOKUP($C30,PREMISSAS!$C$6:$J$13,4,FALSE)))","v":0},null,{"$f":"IF($C30=\"\",0,IF($S30>VLOOKUP($C30,PREMISSAS!$C$6:$J$13,4,FALSE),$S30-VLOOKUP($C30,PREMISSAS!$C$6:$J$13,4,FALSE),0))","v":0},null,null,null,null,null,"","","","","","",""]
[null,null,3,{"$f":"IF(D30=\"\",\"\",IF((D30+1)>'PERIODOS E FERIADOS'!$G$6,\"\",D30+1))","v":"2023-05-23"},"Terça",null,null,null,null,null,null,null,0,null,0,null,null,null,0,null,null,null,{"$f":"IF($C31=\"\",0,IF($S31<=VLOOKUP($C31,PREMISSAS!$C$6:$J$13,4,FALSE),$S31,VLOOKUP($C31,PREMISSAS!$C$6:$J$13,4,FALSE)))","v":0},null,{"$f":"IF($C31=\"\",0,IF($S31>VLOOKUP($C31,PREMISSAS!$C$6:$J$13,4,FALSE),$S31-VLOOKUP($C31,PREMISSAS!$C$6:$J$13,4,FALSE),0))","v":0},null,null,null,null,null,"","","","","","",""]
[null,null,4,{"$f":"IF(D31=\"\",\"\",IF((D31+1)>'PERIODOS E FERIADOS'!$G$6,\"\",D31+1))","v":"2023-05-24"},"Quarta",null,null,null,null,null,null,null,0,null,0,null,null,null,0,null,null,null,{"$f":"IF($C32=\"\",0,IF($S32<=VLOOKUP($C32,PREMISSAS!$C$6:$J$13,4,FALSE),$S32,VLOOKUP($C32,PREMISSAS!$C$6:$J$13,4,FALSE)))","v":0},null,{"$f":"IF($C32=\"\",0,IF($S32>VLOOKUP($C32,PREMISSAS!$C$6:$J$13,4,FALSE),$S32-VLOOKUP($C32,PREMISSAS!$C$6:$J$13,4,FALSE),0))","v":0},null,null,null,null,null,{"$f":"IF(OR(F32=\"\",F32=0,F32=\"FALTA\",F32=\"SUSPENSO\",F32=\"SUSPENSÃO\"),\"\",TEXT(F32,\"##\"\":\"\"##\"))","v":""},{"$f":"IF(OR(G32=\"\",G32=0,G32=\"FALTA\",G32=\"SUSPENSO\",G32=\"SUSPENSÃO\"),\"\",TEXT(G32,\"##\"\":\"\"##\"))","v":""},"","",{"$f":"IF(OR(J32=\"\",J32=0,J32=\"FALTA\",J32=\"SUSPENSO\",J32=\"SUSPENSÃO\"),\"\",TEXT(J32,\"##\"\":\"\"##\"))","v":""},{"$f":"IF(OR(K32=\"\",K32=0,K32=\"FALTA\",K32=\"SUSPENSO\",K32=\"SUSPENSÃO\"),\"\",TEXT(K32,\"##\"\":\"\"##\"))","v":""},""]
[null,null,5,{"$f":"IF(D32=\"\",\"\",IF((D32+1)>'PERIODOS E FERIADOS'!$G$6,\"\",D32+1))","v":"2023-05-25"},"Quinta",null,null,null,null,null,null,null,0,null,0,null,null,null,0,null,null,null,{"$f":"IF($C33=\"\",0,IF($S33<=VLOOKUP($C33,PREMISSAS!$C$6:$J$13,4,FALSE),$S33,VLOOKUP($C33,PREMISSAS!$C$6:$J$13,4,FALSE)))","v":0},null,{"$f":"IF($C33=\"\",0,IF($S33>VLOOKUP($C33,PREMISSAS!$C$6:$J$13,4,FALSE),$S33-VLOOKUP($C33,PREMISSAS!$C$6:$J$13,4,FALSE),0))","v":0},null,null,null,null,null,{"$f":"IF(OR(F33=\"\",F33=0,F33=\"FALTA\",F33=\"SUSPENSO\",F33=\"SUSPENSÃO\"),\"\",TEXT(F33,\"##\"\":\"\"##\"))","v":""},"","","","","",""]
[null,null,6,{"$f":"IF(D33=\"\",\"\",IF((D33+1)>'PERIODOS E FERIADOS'!$G$6,\"\",D33+1))","v":"2023-05-26"},"Sexta",null,null,null,null,null,null,null,0,null,0,null,null,null,0,null,null,null,{"$f":"IF($C34=\"\",0,IF($S34<=VLOOKUP($C34,PREMISSAS!$C$6:$J$13,4,FALSE),$S34,VLOOKUP($C34,PREMISSAS!$C$6:$J$13,4,FALSE)))","v":0},null,{"$f":"IF($C34=\"\",0,IF($S34>VLOOKUP($C34,PREMISSAS!$C$6:$J$13,4,FALSE),$S34-VLOOKUP($C34,PREMISSAS!$C$6:$J$13,4,FALSE),0))","v":0},null,null,null,null,null,"","","","","","",""]
[null,null,7,{"$f":"IF(D34=\"\",\"\",IF((D34+1)>'PERIODOS E FERIADOS'!$G$6,\"\",D34+1))","v":"2023-05-27"},"Sábado",null,null,null,null,null,null,null,0,null,0,null,null,null,0,null,null,null,{"$f":"IF($C35=\"\",0,IF($S35<=VLOOKUP($C35,PREMISSAS!$C$6:$J$13,4,FALSE),$S35,VLOOKUP($C35,PREMISSAS!$C$6:$J$13,4,FALSE)))","v":0},null,{"$f":"IF($C35=\"\",0,IF($S35>VLOOKUP($C35,PREMISSAS!$C$6:$J$13,4,FALSE),$S35-VLOOKUP($C35,PREMISSAS!$C$6:$J$13,4,FALSE),0))","v":0},null,null,null,null,null,"","","","","","",""]
[null,null,1,{"$f":"IF(D35=\"\",\"\",IF((D35+1)>'PERIODOS E FERIADOS'!$G$6,\"\",D35+1))","v":"2023-05-28"},"Domingo",null,null,null,null,null,null,null,0,null,0,null,null,null,0,null,null,null,{"$f":"IF($C36=\"\",0,IF($S36<=VLOOKUP($C36,PREMISSAS!$C$6:$J$13,4,FALSE),$S36,VLOOKUP($C36,PREMISSAS!$C$6:$J$13,4,FALSE)))","v":0},null,{"$f":"IF($C36=\"\",0,IF($S36>VLOOKUP($C36,PREMISSAS!$C$6:$J$13,4,FALSE),$S36-VLOOKUP($C36,PREMISSAS!$C$6:$J$13,4,FALSE),0))","v":0},null,null,null,null,null,"","","","","","",""]
[null,null,2,{"$f":"IF(D36=\"\",\"\",IF((D36+1)>'PERIODOS E FERIADOS'!$G$6,\"\",D36+1))","v":"2023-05-29"},"Segunda",null,null,null,null,null,null,null,0,null,0,null,null,null,0,null,null,null,{"$f":"IF($C37=\"\",0,IF($S37<=VLOOKUP($C37,PREMISSAS!$C$6:$J$13,4,FALSE),$S37,VLOOKUP($C37,PREMISSAS!$C$6:$J$13,4,FALSE)))","v":0},null,{"$f":"IF($C37=\"\",0,IF($S37>VLOOKUP($C37,PREMISSAS!$C$6:$J$13,4,FALSE),$S37-VLOOKUP($C37,PREMISSAS!$C$6:$J$13,4,FALSE),0))","v":0},null,null,null,null,null,"","","","","","",""]
[null,null,3,{"$f":"IF(D37=\"\",\"\",IF((D37+1)>'PERIODOS E FERIADOS'!$G$6,\"\",D37+1))","v":"2023-05-30"},"Terça",null,null,null,null,null,null,null,0,null,0,null,null,null,0,null,null,null,{"$f":"IF($C38=\"\",0,IF($S38<=VLOOKUP($C38,PREMISSAS!$C$6:$J$13,4,FALSE),$S38,VLOOKUP($C38,PREMISSAS!$C$6:$J$13,4,FALSE)))","v":0},null,{"$f":"IF($C38=\"\",0,IF($S38>VLOOKUP($C38,PREMISSAS!$C$6:$J$13,4,FALSE),$S38-VLOOKUP($C38,PREMISSAS!$C$6:$J$13,4,FALSE),0))","v":0},null,null,null,null,null,"","","","","","",""]
[null,null,4,{"$f":"IF(D38=\"\",\"\",IF((D38+1)>'PERIODOS E FERIADOS'!$G$6,\"\",D38+1))","v":"2023-05-31"},"Quarta",null,null,null,null,null,null,null,0,null,0,null,null,null,0,null,null,null,{"$f":"IF($C39=\"\",0,IF($S39<=VLOOKUP($C39,PREMISSAS!$C$6:$J$13,4,FALSE),$S39,VLOOKUP($C39,PREMISSAS!$C$6:$J$13,4,FALSE)))","v":0},null,{"$f":"IF($C39=\"\",0,IF($S39>VLOOKUP($C39,PREMISSAS!$C$6:$J$13,4,FALSE),$S39-VLOOKUP($C39,PREMISSAS!$C$6:$J$13,4,FALSE),0))","v":0},null,null,null,null,null,"","","","","","",""]
[]
[null,null,null,"TOTAIS",null,null,"Faltas / Suspensão",null,{"$f":"COUNTIF($F$9:$F$39,\"FALTA\")+COUNTIF($F$9:$F$39,\"SUSPENSÃO\")+COUNTIF($F$9:$F$39,\"SUSPENSO\")+COUNTIF($F$9:$F$39,\"SUSPENSAO\")","v":0},null,null,null,{"$f":"SUM($M$9:$M$39)","v":0},null,{"$f":"SUM($O$9:$O$39)","v":0},null,null,null,{"$f":"SUM(S$9:S$39)","v":0},null,{"$f":"$AK$41","v":0},null,{"$f":"SUM(W$9:W$39)","v":0},null,{"$f":"SUM(Y$9:Y$39)","v":0},null,null,null,null,null,null,null,null,null,null,null,{"$f":"SUM(AK9:AK39)","v":0}]
[]
[null,null,null,"OBSERVAÇÕES:"]

{"sheet":"FUNC 4","index":8,"n_rows":43,"n_cols":37,"rows_kept":43,"cut":false,"hidden":false,"merged":[[5,30,5,33],[40,3,40,5],[40,6,40,7],[40,8,40,10],[42,3,43,24],[18,26,18,27],[19,26,19,27],[3,3,4,27],[5,3,5,4],[5,5,5,10],[5,12,5,20],[5,22,5,24],[5,26,5,27]]}
[]
[]
[]
[null,null,null,{"$f":"'PERIODOS E FERIADOS'!$E$5","v":0}]
[]
[null,null,null,"Funcionário",null,{"$f":"FUNCIONÁRIOS!E8","v":4},null,null,null,null,null,null,"H.E. / Atrasos / A.N",null,null,null,null,null,null,null,null,null,"Distrib. H.E. p/ Faixa",null,null,null,"CARGA HORÁRIA",null,null,null,"ESPELHO"]
[]
[null,null,null,"Data","Dia Semana","Entrada","Saída","Entrada","Saída","Entrada","Saída",null,"H. Diária",null,"Atrasos",null,"Abona",null,"Horas Extras",null,"Adc. Noturno",null,{"$f":"PREMISSAS!H6","v":0.5},null,{"$f":"PREMISSAS!H12","v":1},2,"SEGUNDA",0.33333333333333331,2,null,"Entrada","Saída","Entrada","Saída","Entrada","Saída","AN "]
[null,null,{"$f":"IF(NOT(ISERROR(VLOOKUP(D9,rngFeriados,1,FALSE))),\"F\",IF(D9=\"\",\"\",WEEKDAY($D9,1)))","v":"F"},{"$f":"'PERIODOS E FERIADOS'!$E$6","v":"2023-05-01"},{"$f":"IF(D9=\"\",\"\",IF(WEEKDAY(D9,1)=1,\"Domingo\",IF(WEEKDAY(D9,1)=2,\"Segunda\",IF(WEEKDAY(D9,1)=3,\"Terça\",IF(WEEKDAY(D9,1)=4,\"Quarta\",IF(WEEKDAY(D9,1)=5,\"Quinta\",IF(WEEKDAY(D9,1)=6,\"Sexta\",IF(WEEKDAY(D9,1)=7,\"Sábado\"))))))))","v":"Segunda"},null,null,null,null,null,null,null,{"$f":"IF(ISERROR(IF(OR($AF9=\"\",$AF9=0),0,(IF(TEXT($AF9,\"[hh]:mm:ss\")<TEXT($AE9,\"[hh]:mm:ss\"),(1-$AE9+$AF9),$AF9-$AE9))+IF(OR($AH9=\"\",$AH9=0),0,(IF(TEXT($AH9,\"[hh]:mm:ss\")<TEXT($AG9,\"[hh]:mm:ss\"),(1-$AG9+$AH9),$AH9-$AG9))+IF(OR($AJ9=\"\",$AJ9=0),0,(IF(TEXT($AJ9,\"[hh]:mm:ss\")<TEXT($AI9,\"[hh]:mm:ss\"),(1-$AI9+$AJ9),$AJ9-$AI9)))))),0,IF(OR($AF9=\"\",$AF9=0),0,(IF(TEXT($AF9,\"[hh]:mm:ss\")<TEXT($AE9,\"[hh]:mm:ss\"),(1-$AE9+$AF9),$AF9-$AE9))+IF(OR($AH9=\"\",$AH9=0),0,(IF(TEXT($AH9,\"[hh]:mm:ss\")<TEXT($AG9,\"[hh]:mm:ss\"),(1-$AG9+$AH9),$AH9-$AG9))+IF(OR($AJ9=\"\",$AJ9=0),0,(IF(TEXT($AJ9,\"[hh]:mm:ss\")<TEXT($AI9,\"[hh]:mm:ss\"),(1-$AI9+$AJ9),$AJ9-$AI9))))))","v":0},null,{"$f":"IF($C9=\"\",0,IF(Q9=\"Sim\",0,IF(TEXT(IF(OR((VLOOKUP($C9,$Z$8:$AB$15,3,FALSE)-$M9)<0,$AE9=\"\"),0,(VLOOKUP($C9,$Z$8:$AB$15,3,FALSE)-$M9)),\"[hh]:mm\")<=TEXT(rngTolerancia,\"[hh]:mm\"),0,IF(OR((VLOOKUP($C9,$Z$8:$AB$15,3,FALSE)-$M9)<0,$AE9=\"\"),0,(VLOOKUP($C9,$Z$8:$AB$15,3,FALSE)-$M9)))))","v":0},null,null,null,{"$f":"IF($C9=\"\",0,IF(TEXT(IF(($M9-VLOOKUP($C9,$Z$8:$AB$15,3,FALSE))<0,0,($M9-VLOOKUP($C9,$Z$8:$AB$15,3,FALSE))),\"[hh]:mm\")<=TEXT(rngTolerancia,\"[hh]:mm\"),0,IF(($M9-VLOOKUP($C9,$Z$8:$AB$15,3,FALSE))<0,0,($M9-VLOOKUP($C9,$Z$8:$AB$15,3,FALSE)))))","v":0},null,null,null,{"$f":"IF($C9=\"\",0,IF($S9<=VLOOKUP($C9,PREMISSAS!$C$6:$J$13,4,FALSE),$S9,VLOOKUP($C9,PREMISSAS!$C$6:$J$13,4,FALSE)))","v":0},null,{"$f":"IF($C9=\"\",0,IF($S9>VLOOKUP($C9,PREMISSAS!$C$6:$J$13,4,FALSE),$S9-VLOOKUP($C9,PREMISSAS!$C$6:$J$13,4,FALSE),0))","v":0},3,"TERÇA",0.33333333333333331,3,null,{"$f":"IF(OR(F9=\"\",F9=0,F9=\"FALTA\",F9=\"SUSPENSO\",F9=\"SUSPENSÃO\"),\"\",TEXT(F9,\"##\"\":\"\"##\"))","v":""},{"$f":"IF(OR(G9=\"\",G9=0,G9=\"FALTA\",G9=\"SUSPENSO\",G9=\"SUSPENSÃO\"),\"\",TEXT(G9,\"##\"\":\"\"##\"))","v":""},"","",{"$f":"IF(OR(J9=\"\",J9=0,J9=\"FALTA\",J9=\"SUSPENSO\",J9=\"SUSPENSÃO\"),\"\",TEXT(J9,\"##\"\":\"\"##\"))","v":""},{"$f":"IF(OR(K9=\"\",K9=0,K9=\"FALTA\",K9=\"SUSPENSO\",K9=\"SUSPENSÃO\"),\"\",TEXT(K9,\"##\"\":\"\"##\"))","v":""},{"$f":"IF(OR(U9=\"\",U9=0,U9=\"FALTA\",U9=\"SUSPENSO\",U9=\"SUSPENSÃO\"),\"\",TEXT(TEXT(U9,\"00\"\":\"\"00\"),\"[hh]:mm\")*1)","v":""}]
[null,null,3,{"$f":"IF(D9=\"\",\"\",IF((D9+1)>'PERIODOS E FERIADOS'!$G$6,\"\",D9+1))","v":"2023-05-02"},{"$f":"IF(D10=\"\",\"\",IF(WEEKDAY(D10,1)=1,\"Domingo\",IF(WEEKDAY(D10,1)=2,\"Segunda\",IF(WEEKDAY(D10,1)=3,\"Terça\",IF(WEEKDAY(D10,1)=4,\"Quarta\",IF(WEEKDAY(D10,1)=5,\"Quinta\",IF(WEEKDAY(D10,1)=6,\"Sexta\",IF(WEEKDAY(D10,1)=7,\"Sábado\"))))))))","v":"Terça"},null,null,null,null,null,null,null,{"$f":"IF(ISERROR(IF(OR($AF10=\"\",$AF10=0),0,(IF(TEXT($AF10,\"[hh]:mm:ss\")<TEXT($AE10,\"[hh]:mm:ss\"),(1-$AE10+$AF10),$AF10-$AE10))+IF(OR($AH10=\"\",$AH10=0),0,(IF(TEXT($AH10,\"[hh]:mm:ss\")<TEXT($AG10,\"[hh]:mm:ss\"),(1-$AG10+$AH10),$AH10-$AG10))+IF(OR($AJ10=\"\",$AJ10=0),0,(IF(TEXT($AJ10,\"[hh]:mm:ss\")<TEXT($AI10,\"[hh]:mm:ss\"),(1-$AI10+$AJ10),$AJ10-$AI10)))))),0,IF(OR($AF10=\"\",$AF10=0),0,(IF(TEXT($AF10,\"[hh]:mm:ss\")<TEXT($AE10,\"[hh]:mm:ss\"),(1-$AE10+$AF10),$AF10-$AE10))+IF(OR($AH10=\"\",$AH10=0),0,(IF(TEXT($AH10,\"[hh]:mm:ss\")<TEXT($AG10,\"[hh]:mm:ss\"),(1-$AG10+$AH10),$AH10-$AG10))+IF(OR($AJ10=\"\",$AJ10=0),0,(IF(TEXT($AJ10,\"[hh]:mm:ss\")<TEXT($AI10,\"[hh]:mm:ss\"),(1-$AI10+$AJ10),$AJ10-$AI10))))))","v":0},null,{"$f":"IF($C10=\"\",0,IF(Q10=\"Sim\",0,IF(TEXT(IF(OR((VLOOKUP($C10,$Z$8:$AB$15,3,FALSE)-$M10)<0,$AE10=\"\"),0,(VLOOKUP($C10,$Z$8:$AB$15,3,FALSE)-$M10)),\"[hh]:mm\")<=TEXT(rngTolerancia,\"[hh]:mm\"),0,IF(OR((VLOOKUP($C10,$Z$8:$AB$15,3,FALSE)-$M10)<0,$AE10=\"\"),0,(VLOOKUP($C10,$Z$8:$AB$15,3,FALSE)-$M10)))))","v":0},null,null,null,0,null,null,null,{"$f":"IF($C10=\"\",0,IF($S10<=VLOOKUP($C10,PREMISSAS!$C$6:$J$13,4,FALSE),$S10,VLOOKUP($C10,PREMISSAS!$C$6:$J$13,4,FALSE)))","v":0},null,{"$f":"IF($C10=\"\",0,IF($S10>VLOOKUP($C10,PREMISSAS!$C$6:$J$13,4,FALSE),$S10-VLOOKUP($C10,PREMISSAS!$C$6:$J$13,4,FALSE),0))","v":0},4,"QUARTA",0.33333333333333331,4,null,{"$f":"IF(OR(F10=\"\",F10=0,F10=\"FALTA\",F10=\"SUSPENSO\",F10=\"SUSPENSÃO\"),\"\",TEXT(F10,\"##\"\":\"\"##\"))","v":""},"","","","","",{"$f":"IF(OR(U10=\"\",U10=0,U10=\"FALTA\",U10=\"SUSPENSO\",U10=\"SUSPENSÃO\"),\"\",TEXT(TEXT(U10,\"00\"\":\"\"00\"),\"[hh]:mm\")*1)","v":""}]
[null,null,4,{"$f":"IF(D10=\"\",\"\",IF((D10+1)>'PERIODOS E FERIADOS'!$G$6,\"\",D10+1))","v":"2023-05-03"},"Quarta",null,null,null,null,null,null,null,0,null,0,null,null,null,0,null,null,null,{"$f":"IF($C11=\"\",0,IF($S11<=VLOOKUP($C11,PREMISSAS!$C$6:$J$13,4,FALSE),$S11,VLOOKUP($C11,PREMISSAS!$C$6:$J$13,4,FALSE)))","v":0},null,{"$f":"IF($C11=\"\",0,IF($S11>VLOOKUP($C11,PREMISSAS!$C$6:$J$13,4,FALSE),$S11-VLOOKUP($C11,PREMISSAS!$C$6:$J$13,4,FALSE),0))","v":0},5,"QUINTA",0.33333333333333331,5,null,"","","","","","",""]
[null,null,5,{"$f":"IF(D11=\"\",\"\",IF((D11+1)>'PERIODOS E FERIADOS'!$G$6,\"\",D11+1))","v":"2023-05-04"},"Quinta",null,null,null,null,null,null,null,0,null,0,null,null,null,0,null,null,null,{"$f":"IF($C12=\"\",0,IF($S12<=VLOOKUP($C12,PREMISSAS!$C$6:$J$13,4,FALSE),$S12,VLOOKUP($C12,PREMISSAS!$C$6:$J$13,4,FALSE)))","v":0},null,{"$f":"IF($C12=\"\",0,IF($S12>VLOOKUP($C12,PREMISSAS!$C$6:$J$13,4,FALSE),$S12-VLOOKUP($C12,PREMISSAS!$C$6:$J$13,4,FALSE),0))","v":0},6,"SEXTA",0.33333333333333331,6,null,"","","","","","",{"$f":"IF(OR(U12=\"\",U12=0,U12=\"FALTA\",U12=\"SUSPENSO\",U12=\"SUSPENSÃO\"),\"\",TEXT(TEXT(U12,\"##\"\":\"\"##\"),\"[hh]:mm\")*1)","v":""}]
[null,null,6,{"$f":"IF(D12=\"\",\"\",IF((D12+1)>'PERIODOS E FERIADOS'!$G$6,\"\",D12+1))","v":"2023-05-05"},"Sexta",null,null,null,null,null,null,null,0,null,0,null,null,null,0,null,null,null,{"$f":"IF($C13=\"\",0,IF($S13<=VLOOKUP($C13,PREMISSAS!$C$6:$J$13,4,FALSE),$S13,VLOOKUP($C13,PREMISSAS!$C$6:$J$13,4,FALSE)))","v":0},null,{"$f":"IF($C13=\"\",0,IF($S13>VLOOKUP($C13,PREMISSAS!$C$6:$J$13,4,FALSE),$S13-VLOOKUP($C13,PREMISSAS!$C$6:$J$13,4,FALSE),0))","v":0},7,"SÁBADO",0.16666666666666666,7,null,"","","","","","",""]
[null,null,7,{"$f":"IF(D13=\"\",\"\",IF((D13+1)>'PERIODOS E FERIADOS'!$G$6,\"\",D13+1))","v":"2023-05-06"},"Sábado",null,null,null,null,null,null,null,0,null,0,null,null,null,0,null,null,null,{"$f":"IF($C14=\"\",0,IF($S14<=VLOOKUP($C14,PREMISSAS!$C$6:$J$13,4,FALSE),$S14,VLOOKUP($C14,PREMISSAS!$C$6:$J$13,4,FALSE)))","v":0},null,{"$f":"IF($C14=\"\",0,IF($S14>VLOOKUP($C14,PREMISSAS!$C$6:$J$13,4,FALSE),$S14-VLOOKUP($C14,PREMISSAS!$C$6:$J$13,4,FALSE),0))","v":0},1,"DOMINGO",0,1,null,"","","","","","",""]
[null,null,1,{"$f":"IF(D14=\"\",\"\",IF((D14+1)>'PERIODOS E FERIADOS'!$G$6,\"\",D14+1))","v":"2023-05-07"},"Domingo",null,null,null,null,null,null,null,0,null,0,null,null,null,0,null,null,null,{"$f":"IF($C15=\"\",0,IF($S15<=VLOOKUP($C15,PREMISSAS!$C$6:$J$13,4,FALSE),$S15,VLOOKUP($C15,PREMISSAS!$C$6:$J$13,4,FALSE)))","v":0},null,{"$f":"IF($C15=\"\",0,IF($S15>VLOOKUP($C15,PREMISSAS!$C$6:$J$13,4,FALSE),$S15-VLOOKUP($C15,PREMISSAS!$C$6:$J$13,4,FALSE),0))","v":0},"F","FERIADOS",0,"F",null,"","","","","","",""]
[null,null,2,{"$f":"IF(D15=\"\",\"\",IF((D15+1)>'PERIODOS E FERIADOS'!$G$6,\"\",D15+1))","v":"2023-05-08"},"Segunda",null,null,null,null,null,null,null,0,null,0,null,null,null,0,null,null,null,{"$f":"IF($C16=\"\",0,IF($S16<=VLOOKUP($C16,PREMISSAS!$C$6:$J$13,4,FALSE),$S16,VLOOKUP($C16,PREMISSAS!$C$6:$J$13,4,FALSE)))","v":0},null,{"$f":"IF($C16=\"\",0,IF($S16>VLOOKUP($C16,PREMISSAS!$C$6:$J$13,4,FALSE),$S16-VLOOKUP($C16,PREMISSAS!$C$6:$J$13,4,FALSE),0))","v":0},null,"TOTAL SEMANA",{"$f":"SUM(AB8:AB15)","v":1.8333333333333333},null,null,"","","","","","",""]
[null,null,3,{"$f":"IF(D16=\"\",\"\",IF((D16+1)>'PERIODOS E FERIADOS'!$G$6,\"\",D16+1))","v":"2023-05-09"},"Terça",null,null,null,null,null,null,null,0,null,0,null,null,null,0,null,null,null,{"$f":"IF($C17=\"\",0,IF($S17<=VLOOKUP($C17,PREMISSAS!$C$6:$J$13,4,FALSE),$S17,VLOOKUP($C17,PREMISSAS!$C$6:$J$13,4,FALSE)))","v":0},null,{"$f":"IF($C17=\"\",0,IF($S17>VLOOKUP($C17,PREMISSAS!$C$6:$J$13,4,FALSE),$S17-VLOOKUP($C17,PREMISSAS!$C$6:$J$13,4,FALSE),0))","v":0},null,"JORNADA MENSAL",{"$f":"AB16*5","v":9.1666666666666661},null,null,"","","","","","",""]
[null,null,4,{"$f":"IF(D17=\"\",\"\",IF((D17+1)>'PERIODOS E FERIADOS'!$G$6,\"\",D17+1))","v":"2023-05-10"},"Quarta",null,null,null,null,null,null,null,0,null,0,null,null,null,0,null,null,null,{"$f":"IF($C18=\"\",0,IF($S18<=VLOOKUP($C18,PREMISSAS!$C$6:$J$13,4,FALSE),$S18,VLOOKUP($C18,PREMISSAS!$C$6:$J$13,4,FALSE)))","v":0},null,{"$f":"IF($C18=\"\",0,IF($S18>VLOOKUP($C18,PREMISSAS!$C$6:$J$13,4,FALSE),$S18-VLOOKUP($C18,PREMISSAS!$C$6:$J$13,4,FALSE),0))","v":0},null,null,null,null,null,"","","","","","",""]
[null,null,5,{"$f":"IF(D18=\"\",\"\",IF((D18+1)>'PERIODOS E FERIADOS'!$G$6,\"\",D18+1))","v":"2023-05-11"},"Quinta",null,null,null,null,null,null,null,0,null,0,null,null,null,0,null,null,null,{"$f":"IF($C19=\"\",0,IF($S19<=VLOOKUP($C19,PREMISSAS!$C$6:$J$13,4,FALSE),$S19,VLOOKUP($C19,PREMISSAS!$C$6:$J$13,4,FALSE)))","v":0},null,{"$f":"IF($C19=\"\",0,IF($S19>VLOOKUP($C19,PREMISSAS!$C$6:$J$13,4,FALSE),$S19-VLOOKUP($C19,PREMISSAS!$C$6:$J$13,4,FALSE),0))","v":0},null,{"$f":"IF(AB$16>AB$23,\"Jornada Superior a permitida\",IF(AB$16<=AB$23,\"\"))","v":""},null,null,null,"","","","","","",""]
[null,null,6,{"$f":"IF(D19=\"\",\"\",IF((D19+1)>'PERIODOS E FERIADOS'!$G$6,\"\",D19+1))","v":"2023-05-12"},"Sexta",null,null,null,null,null,null,null,0,null,0,null,null,null,0,null,null,null,{"$f":"IF($C20=\"\",0,IF($S20<=VLOOKUP($C20,PREMISSAS!$C$6:$J$13,4,FALSE),$S20,VLOOKUP($C20,PREMISSAS!$C$6:$J$13,4,FALSE)))","v":0},null,{"$f":"IF($C20=\"\",0,IF($S20>VLOOKUP($C20,PREMISSAS!$C$6:$J$13,4,FALSE),$S20-VLOOKUP($C20,PREMISSAS!$C$6:$J$13,4,FALSE),0))","v":0},null,{"$f":"IF(AB$16>AB$23,\"\",IF(AB$16<=AB$23,\"Jornada Ok\"))","v":"Jornada Ok"},null,null,null,"","","","","","",""]
[null,null,7,{"$f":"IF(D20=\"\",\"\",IF((D20+1)>'PERIODOS E FERIADOS'!$G$6,\"\",D20+1))","v":"2023-05-13"},"Sábado",null,null,null,null,null,null,null,0,null,0,null,null,null,0,null,null,null,{"$f":"IF($C21=\"\",0,IF($S21<=VLOOKUP($C21,PREMISSAS!$C$6:$J$13,4,FALSE),$S21,VLOOKUP($C21,PREMISSAS!$C$6:$J$13,4,FALSE)))","v":0},null,{"$f":"IF($C21=\"\",0,IF($S21>VLOOKUP($C21,PREMISSAS!$C$6:$J$13,4,FALSE),$S21-VLOOKUP($C21,PREMISSAS!$C$6:$J$13,4,FALSE),0))","v":0},null,null,null,null,null,"","","","","","",""]
[null,null,1,{"$f":"IF(D21=\"\",\"\",IF((D21+1)>'PERIODOS E FERIADOS'!$G$6,\"\",D21+1))","v":"2023-05-14"},"Domingo",null,null,null,null,null,null,null,0,null,0,null,null,null,0,null,null,null,{"$f":"IF($C22=\"\",0,IF($S22<=VLOOKUP($C22,PREMISSAS!$C$6:$J$13,4,FALSE),$S22,VLOOKUP($C22,PREMISSAS!$C$6:$J$13,4,FALSE)))","v":0},null,{"$f":"IF($C22=\"\",0,IF($S22>VLOOKUP($C22,PREMISSAS!$C$6:$J$13,4,FALSE),$S22-VLOOKUP($C22,PREMISSAS!$C$6:$J$13,4,FALSE),0))","v":0},null,null,null,null,null,"","","","","","",""]
[null,null,2,{"$f":"IF(D22=\"\",\"\",IF((D22+1)>'PERIODOS E FERIADOS'!$G$6,\"\",D22+1))","v":"2023-05-15"},"Segunda",null,null,null,null,null,null,null,0,null,0,null,null,null,0,null,null,null,{"$f":"IF($C23=\"\",0,IF($S23<=VLOOKUP($C23,PREMISSAS!$C$6:$J$13,4,FALSE),$S23,VLOOKUP($C23,PREMISSAS!$C$6:$J$13,4,FALSE)))","v":0},null,{"$f":"IF($C23=\"\",0,IF($S23>VLOOKUP($C23,PREMISSAS!$C$6:$J$13,4,FALSE),$S23-VLOOKUP($C23,PREMISSAS!$C$6:$J$13,4,FALSE),0))","v":0},null,"Jornada Maxima",1.8333333333333333,null,null,"","","","","","",""]
[null,null,3,{"$f":"IF(D23=\"\",\"\",IF((D23+1)>'PERIODOS E FERIADOS'!$G$6,\"\",D23+1))","v":"2023-05-16"},"Terça",null,null,null,null,null,null,null,0,null,0,null,null,null,0,null,null,null,{"$f":"IF($C24=\"\",0,IF($S24<=VLOOKUP($C24,PREMISSAS!$C$6:$J$13,4,FALSE),$S24,VLOOKUP($C24,PREMISSAS!$C$6:$J$13,4,FALSE)))","v":0},null,{"$f":"IF($C24=\"\",0,IF($S24>VLOOKUP($C24,PREMISSAS!$C$6:$J$13,4,FALSE),$S24-VLOOKUP($C24,PREMISSAS!$C$6:$J$13,4,FALSE),0))","v":0},null,null,null,null,null,"","","","","","",""]
[null,null,4,{"$f":"IF(D24=\"\",\"\",IF((D24+1)>'PERIODOS E FERIADOS'!$G$6,\"\",D24+1))","v":"2023-05-17"},"Quarta",null,null,null,null,null,null,null,0,null,0,null,null,null,0,null,null,null,{"$f":"IF($C25=\"\",0,IF($S25<=VLOOKUP($C25,PREMISSAS!$C$6:$J$13,4,FALSE),$S25,VLOOKUP($C25,PREMISSAS!$C$6:$J$13,4,FALSE)))","v":0},null,{"$f":"IF($C25=\"\",0,IF($S25>VLOOKUP($C25,PREMISSAS!$C$6:$J$13,4,FALSE),$S25-VLOOKUP($C25,PREMISSAS!$C$6:$J$13,4,FALSE),0))","v":0},null,null,null,null,null,"","","","","","",""]
[null,null,5,{"$f":"IF(D25=\"\",\"\",IF((D25+1)>'PERIODOS E FERIADOS'!$G$6,\"\",D25+1))","v":"2023-05-18"},"Quinta",null,null,null,null,null,null,null,0,null,0,null,null,null,0,null,null,null,{"$f":"IF($C26=\"\",0,IF($S26<=VLOOKUP($C26,PREMISSAS!$C$6:$J$13,4,FALSE),$S26,VLOOKUP($C26,PREMISSAS!$C$6:$J$13,4,FALSE)))","v":0},null,{"$f":"IF($C26=\"\",0,IF($S26>VLOOKUP($C26,PREMISSAS!$C$6:$J$13,4,FALSE),$S26-VLOOKUP($C26,PREMISSAS!$C$6:$J$13,4,FALSE),0))","v":0},null,null,null,null,null,"","","","","","",""]
[null,null,6,{"$f":"IF(D26=\"\",\"\",IF((D26+1)>'PERIODOS E FERIADOS'!$G$6,\"\",D26+1))","v":"2023-05-19"},"Sexta",null,null,null,null,null,null,null,0,null,0,null,null,null,0,null,null,null,{"$f":"IF($C27=\"\",0,IF($S27<=VLOOKUP($C27,PREMISSAS!$C$6:$J$13,4,FALSE),$S27,VLOOKUP($C27,PREMISSAS!$C$6:$J$13,4,FALSE)))","v":0},null,{"$f":"IF($C27=\"\",0,IF($S27>VLOOKUP($C27,PREMISSAS!$C$6:$J$13,4,FALSE),$S27-VLOOKUP($C27,PREMISSAS!$C$6:$J$13,4,FALSE),0))","v":0},null,null,null,null,null,"","","","","","",""]
[null,null,7,{"$f":"IF(D27=\"\",\"\",IF((D27+1)>'PERIODOS E FERIADOS'!$G$6,\"\",D27+1))","v":"2023-05-20"},"Sábado",null,null,null,null,null,null,null,0,null,0,null,null,null,0,null,null,null,{"$f":"IF($C28=\"\",0,IF($S28<=VLOOKUP($C28,PREMISSAS!$C$6:$J$13,4,FALSE),$S28,VLOOKUP($C28,PREMISSAS!$C$6:$J$13,4,FALSE)))","v":0},null,{"$f":"IF($C28=\"\",0,IF($S28>VLOOKUP($C28,PREMISSAS!$C$6:$J$13,4,FALSE),$S28-VLOOKUP($C28,PREMISSAS!$C$6:$J$13,4,FALSE),0))","v":0},null,null,null,null,null,"","","","","","",""]
[null,null,1,{"$f":"IF(D28=\"\",\"\",IF((D28+1)>'PERIODOS E FERIADOS'!$G$6,\"\",D28+1))","v":"2023-05-21"},"Domingo",null,null,null,null,null,null,null,0,null,0,null,null,null,0,null,null,null,{"$f":"IF($C29=\"\",0,IF($S29<=VLOOKUP($C29,PREMISSAS!$C$6:$J$13,4,FALSE),$S29,VLOOKUP($C29,PREMISSAS!$C$6:$J$13,4,FALSE)))","v":0},null,{"$f":"IF($C29=\"\",0,IF($S29>VLOOKUP($C29,PREMISSAS!$C$6:$J$13,4,FALSE),$S29-VLOOKUP($C29,PREMISSAS!$C$6:$J$13,4,FALSE),0))","v":0},null,null,null,null,null,"","","","","","",""]
[null,null,2,{"$f":"IF(D29=\"\",\"\",IF((D29+1)>'PERIODOS E FERIADOS'!$G$6,\"\",D29+1))","v":"2023-05-22"},"Segunda",null,null,null,null,null,null,null,0,null,0,null,null,null,0,null,null,null,{"$f":"IF($C30=\"\",0,IF($S30<=VLOOKUP($C30,PREMISSAS!$C$6:$J$13,4,FALSE),$S30,VLOOKUP($C30,PREMISSAS!$C$6:$J$13,4,FALSE)))","v":0},null,{"$f":"IF($C30=\"\",0,IF($S30>VLOOKUP($C30,PREMISSAS!$C$6:$J$13,4,FALSE),$S30-VLOOKUP($C30,PREMISSAS!$C$6:$J$13,4,FALSE),0))","v":0},null,null,null,null,null,"","","","","","",""]
[null,null,3,{"$f":"IF(D30=\"\",\"\",IF((D30+1)>'PERIODOS E FERIADOS'!$G$6,\"\",D30+1))","v":"2023-05-23"},"Terça",null,null,null,null,null,null,null,0,null,0,null,null,null,0,null,null,null,{"$f":"IF($C31=\"\",0,IF($S31<=VLOOKUP($C31,PREMISSAS!$C$6:$J$13,4,FALSE),$S31,VLOOKUP($C31,PREMISSAS!$C$6:$J$13,4,FALSE)))","v":0},null,{"$f":"IF($C31=\"\",0,IF($S31>VLOOKUP($C31,PREMISSAS!$C$6:$J$13,4,FALSE),$S31-VLOOKUP($C31,PREMISSAS!$C$6:$J$13,4,FALSE),0))","v":0},null,null,null,null,null,"","","","","","",""]
[null,null,4,{"$f":"IF(D31=\"\",\"\",IF((D31+1)>'PERIODOS E FERIADOS'!$G$6,\"\",D31+1))","v":"2023-05-24"},"Quarta",null,null,null,null,null,null,null,0,null,0,null,null,null,0,null,null,null,{"$f":"IF($C32=\"\",0,IF($S32<=VLOOKUP($C32,PREMISSAS!$C$6:$J$13,4,FALSE),$S32,VLOOKUP($C32,PREMISSAS!$C$6:$J$13,4,FALSE)))","v":0},null,{"$f":"IF($C32=\"\",0,IF($S32>VLOOKUP($C32,PREMISSAS!$C$6:$J$13,4,FALSE),$S32-VLOOKUP($C32,PREMISSAS!$C$6:$J$13,4,FALSE),0))","v":0},null,null,null,null,null,{"$f":"IF(OR(F32=\"\",F32=0,F32=\"FALTA\",F32=\"SUSPENSO\",F32=\"SUSPENSÃO\"),\"\",TEXT(F32,\"##\"\":\"\"##\"))","v":""},{"$f":"IF(OR(G32=\"\",G32=0,G32=\"FALTA\",G32=\"SUSPENSO\",G32=\"SUSPENSÃO\"),\"\",TEXT(G32,\"##\"\":\"\"##\"))","v":""},"","",{"$f":"IF(OR(J32=\"\",J32=0,J32=\"FALTA\",J32=\"SUSPENSO\",J32=\"SUSPENSÃO\"),\"\",TEXT(J32,\"##\"\":\"\"##\"))","v":""},{"$f":"IF(OR(K32=\"\",K32=0,K32=\"FALTA\",K32=\"SUSPENSO\",K32=\"SUSPENSÃO\"),\"\",TEXT(K32,\"##\"\":\"\"##\"))","v":""},""]
[null,null,5,{"$f":"IF(D32=\"\",\"\",IF((D32+1)>'PERIODOS E FERIADOS'!$G$6,\"\",D32+1))","v":"2023-05-25"},"Quinta",null,null,null,null,null,null,null,0,null,0,null,null,null,0,null,null,null,{"$f":"IF($C33=\"\",0,IF($S33<=VLOOKUP($C33,PREMISSAS!$C$6:$J$13,4,FALSE),$S33,VLOOKUP($C33,PREMISSAS!$C$6:$J$13,4,FALSE)))","v":0},null,{"$f":"IF($C33=\"\",0,IF($S33>VLOOKUP($C33,PREMISSAS!$C$6:$J$13,4,FALSE),$S33-VLOOKUP($C33,PREMISSAS!$C$6:$J$13,4,FALSE),0))","v":0},null,null,null,null,null,{"$f":"IF(OR(F33=\"\",F33=0,F33=\"FALTA\",F33=\"SUSPENSO\",F33=\"SUSPENSÃO\"),\"\",TEXT(F33,\"##\"\":\"\"##\"))","v":""},"","","","","",""]
[null,null,6,{"$f":"IF(D33=\"\",\"\",IF((D33+1)>'PERIODOS E FERIADOS'!$G$6,\"\",D33+1))","v":"2023-05-26"},"Sexta",null,null,null,null,null,null,null,0,null,0,null,null,null,0,null,null,null,{"$f":"IF($C34=\"\",0,IF($S34<=VLOOKUP($C34,PREMISSAS!$C$6:$J$13,4,FALSE),$S34,VLOOKUP($C34,PREMISSAS!$C$6:$J$13,4,FALSE)))","v":0},null,{"$f":"IF($C34=\"\",0,IF($S34>VLOOKUP($C34,PREMISSAS!$C$6:$J$13,4,FALSE),$S34-VLOOKUP($C34,PREMISSAS!$C$6:$J$13,4,FALSE),0))","v":0},null,null,null,null,null,"","","","","","",""]
[null,null,7,{"$f":"IF(D34=\"\",\"\",IF((D34+1)>'PERIODOS E FERIADOS'!$G$6,\"\",D34+1))","v":"2023-05-27"},"Sábado",null,null,null,null,null,null,null,0,null,0,null,null,null,0,null,null,null,{"$f":"IF($C35=\"\",0,IF($S35<=VLOOKUP($C35,PREMISSAS!$C$6:$J$13,4,FALSE),$S35,VLOOKUP($C35,PREMISSAS!$C$6:$J$13,4,FALSE)))","v":0},null,{"$f":"IF($C35=\"\",0,IF($S35>VLOOKUP($C35,PREMISSAS!$C$6:$J$13,4,FALSE),$S35-VLOOKUP($C35,PREMISSAS!$C$6:$J$13,4,FALSE),0))","v":0},null,null,null,null,null,"","","","","","",""]
[null,null,1,{"$f":"IF(D35=\"\",\"\",IF((D35+1)>'PERIODOS E FERIADOS'!$G$6,\"\",D35+1))","v":"2023-05-28"},"Domingo",null,null,null,null,null,null,null,0,null,0,null,null,null,0,null,null,null,{"$f":"IF($C36=\"\",0,IF($S36<=VLOOKUP($C36,PREMISSAS!$C$6:$J$13,4,FALSE),$S36,VLOOKUP($C36,PREMISSAS!$C$6:$J$13,4,FALSE)))","v":0},null,{"$f":"IF($C36=\"\",0,IF($S36>VLOOKUP($C36,PREMISSAS!$C$6:$J$13,4,FALSE),$S36-VLOOKUP($C36,PREMISSAS!$C$6:$J$13,4,FALSE),0))","v":0},null,null,null,null,null,"","","","","","",""]
[null,null,2,{"$f":"IF(D36=\"\",\"\",IF((D36+1)>'PERIODOS E FERIADOS'!$G$6,\"\",D36+1))","v":"2023-05-29"},"Segunda",null,null,null,null,null,null,null,0,null,0,null,null,null,0,null,null,null,{"$f":"IF($C37=\"\",0,IF($S37<=VLOOKUP($C37,PREMISSAS!$C$6:$J$13,4,FALSE),$S37,VLOOKUP($C37,PREMISSAS!$C$6:$J$13,4,FALSE)))","v":0},null,{"$f":"IF($C37=\"\",0,IF($S37>VLOOKUP($C37,PREMISSAS!$C$6:$J$13,4,FALSE),$S37-VLOOKUP($C37,PREMISSAS!$C$6:$J$13,4,FALSE),0))","v":0},null,null,null,null,null,"","","","","","",""]
[null,null,3,{"$f":"IF(D37=\"\",\"\",IF((D37+1)>'PERIODOS E FERIADOS'!$G$6,\"\",D37+1))","v":"2023-05-30"},"Terça",null,null,null,null,null,null,null,0,null,0,null,null,null,0,null,null,null,{"$f":"IF($C38=\"\",0,IF($S38<=VLOOKUP($C38,PREMISSAS!$C$6:$J$13,4,FALSE),$S38,VLOOKUP($C38,PREMISSAS!$C$6:$J$13,4,FALSE)))","v":0},null,{"$f":"IF($C38=\"\",0,IF($S38>VLOOKUP($C38,PREMISSAS!$C$6:$J$13,4,FALSE),$S38-VLOOKUP($C38,PREMISSAS!$C$6:$J$13,4,FALSE),0))","v":0},null,null,null,null,null,"","","","","","",""]
[null,null,4,{"$f":"IF(D38=\"\",\"\",IF((D38+1)>'PERIODOS E FERIADOS'!$G$6,\"\",D38+1))","v":"2023-05-31"},"Quarta",null,null,null,null,null,null,null,0,null,0,null,null,null,0,null,null,null,{"$f":"IF($C39=\"\",0,IF($S39<=VLOOKUP($C39,PREMISSAS!$C$6:$J$13,4,FALSE),$S39,VLOOKUP($C39,PREMISSAS!$C$6:$J$13,4,FALSE)))","v":0},null,{"$f":"IF($C39=\"\",0,IF($S39>VLOOKUP($C39,PREMISSAS!$C$6:$J$13,4,FALSE),$S39-VLOOKUP($C39,PREMISSAS!$C$6:$J$13,4,FALSE),0))","v":0},null,null,null,null,null,"","","","","","",""]
[]
[null,null,null,"TOTAIS",null,null,"Faltas / Suspensão",null,{"$f":"COUNTIF($F$9:$F$39,\"FALTA\")+COUNTIF($F$9:$F$39,\"SUSPENSÃO\")+COUNTIF($F$9:$F$39,\"SUSPENSO\")+COUNTIF($F$9:$F$39,\"SUSPENSAO\")","v":0},null,null,null,{"$f":"SUM($M$9:$M$39)","v":0},null,{"$f":"SUM($O$9:$O$39)","v":0},null,null,null,{"$f":"SUM(S$9:S$39)","v":0},null,{"$f":"$AK$41","v":0},null,{"$f":"SUM(W$9:W$39)","v":0},null,{"$f":"SUM(Y$9:Y$39)","v":0},null,null,null,null,null,null,null,null,null,null,null,{"$f":"SUM(AK9:AK39)","v":0}]
[]
[null,null,null,"OBSERVAÇÕES:"]

{"sheet":"FUNC 5","index":9,"n_rows":43,"n_cols":37,"rows_kept":43,"cut":false,"hidden":false,"merged":[[5,30,5,33],[40,3,40,5],[40,6,40,7],[40,8,40,10],[42,3,43,24],[18,26,18,27],[19,26,19,27],[3,3,4,27],[5,3,5,4],[5,5,5,10],[5,12,5,20],[5,22,5,24],[5,26,5,27]]}
[]
[]
[]
[null,null,null,{"$f":"'PERIODOS E FERIADOS'!$E$5","v":0}]
[]
[null,null,null,"Funcionário",null,{"$f":"FUNCIONÁRIOS!E9","v":5},null,null,null,null,null,null,"H.E. / Atrasos / A.N",null,null,null,null,null,null,null,null,null,"Distrib. H.E. p/ Faixa",null,null,null,"CARGA HORÁRIA",null,null,null,"ESPELHO"]
[]
[null,null,null,"Data","Dia Semana","Entrada","Saída","Entrada","Saída","Entrada","Saída",null,"H. Diária",null,"Atrasos",null,"Abona",null,"Horas Extras",null,"Adc. Noturno",null,{"$f":"PREMISSAS!H6","v":0.5},null,{"$f":"PREMISSAS!H12","v":1},2,"SEGUNDA",0.33333333333333331,2,null,"Entrada","Saída","Entrada","Saída","Entrada","Saída","AN "]
[null,null,{"$f":"IF(NOT(ISERROR(VLOOKUP(D9,rngFeriados,1,FALSE))),\"F\",IF(D9=\"\",\"\",WEEKDAY($D9,1)))","v":"F"},{"$f":"'PERIODOS E FERIADOS'!$E$6","v":"2023-05-01"},{"$f":"IF(D9=\"\",\"\",IF(WEEKDAY(D9,1)=1,\"Domingo\",IF(WEEKDAY(D9,1)=2,\"Segunda\",IF(WEEKDAY(D9,1)=3,\"Terça\",IF(WEEKDAY(D9,1)=4,\"Quarta\",IF(WEEKDAY(D9,1)=5,\"Quinta\",IF(WEEKDAY(D9,1)=6,\"Sexta\",IF(WEEKDAY(D9,1)=7,\"Sábado\"))))))))","v":"Segunda"},null,null,null,null,null,null,null,{"$f":"IF(ISERROR(IF(OR($AF9=\"\",$AF9=0),0,(IF(TEXT($AF9,\"[hh]:mm:ss\")<TEXT($AE9,\"[hh]:mm:ss\"),(1-$AE9+$AF9),$AF9-$AE9))+IF(OR($AH9=\"\",$AH9=0),0,(IF(TEXT($AH9,\"[hh]:mm:ss\")<TEXT($AG9,\"[hh]:mm:ss\"),(1-$AG9+$AH9),$AH9-$AG9))+IF(OR($AJ9=\"\",$AJ9=0),0,(IF(TEXT($AJ9,\"[hh]:mm:ss\")<TEXT($AI9,\"[hh]:mm:ss\"),(1-$AI9+$AJ9),$AJ9-$AI9)))))),0,IF(OR($AF9=\"\",$AF9=0),0,(IF(TEXT($AF9,\"[hh]:mm:ss\")<TEXT($AE9,\"[hh]:mm:ss\"),(1-$AE9+$AF9),$AF9-$AE9))+IF(OR($AH9=\"\",$AH9=0),0,(IF(TEXT($AH9,\"[hh]:mm:ss\")<TEXT($AG9,\"[hh]:mm:ss\"),(1-$AG9+$AH9),$AH9-$AG9))+IF(OR($AJ9=\"\",$AJ9=0),0,(IF(TEXT($AJ9,\"[hh]:mm:ss\")<TEXT($AI9,\"[hh]:mm:ss\"),(1-$AI9+$AJ9),$AJ9-$AI9))))))","v":0},null,{"$f":"IF($C9=\"\",0,IF(Q9=\"Sim\",0,IF(TEXT(IF(OR((VLOOKUP($C9,$Z$8:$AB$15,3,FALSE)-$M9)<0,$AE9=\"\"),0,(VLOOKUP($C9,$Z$8:$AB$15,3,FALSE)-$M9)),\"[hh]:mm\")<=TEXT(rngTolerancia,\"[hh]:mm\"),0,IF(OR((VLOOKUP($C9,$Z$8:$AB$15,3,FALSE)-$M9)<0,$AE9=\"\"),0,(VLOOKUP($C9,$Z$8:$AB$15,3,FALSE)-$M9)))))","v":0},null,null,null,{"$f":"IF($C9=\"\",0,IF(TEXT(IF(($M9-VLOOKUP($C9,$Z$8:$AB$15,3,FALSE))<0,0,($M9-VLOOKUP($C9,$Z$8:$AB$15,3,FALSE))),\"[hh]:mm\")<=TEXT(rngTolerancia,\"[hh]:mm\"),0,IF(($M9-VLOOKUP($C9,$Z$8:$AB$15,3,FALSE))<0,0,($M9-VLOOKUP($C9,$Z$8:$AB$15,3,FALSE)))))","v":0},null,null,null,{"$f":"IF($C9=\"\",0,IF($S9<=VLOOKUP($C9,PREMISSAS!$C$6:$J$13,4,FALSE),$S9,VLOOKUP($C9,PREMISSAS!$C$6:$J$13,4,FALSE)))","v":0},null,{"$f":"IF($C9=\"\",0,IF($S9>VLOOKUP($C9,PREMISSAS!$C$6:$J$13,4,FALSE),$S9-VLOOKUP($C9,PREMISSAS!$C$6:$J$13,4,FALSE),0))","v":0},3,"TERÇA",0.33333333333333331,3,null,{"$f":"IF(OR(F9=\"\",F9=0,F9=\"FALTA\",F9=\"SUSPENSO\",F9=\"SUSPENSÃO\"),\"\",TEXT(F9,\"##\"\":\"\"##\"))","v":""},{"$f":"IF(OR(G9=\"\",G9=0,G9=\"FALTA\",G9=\"SUSPENSO\",G9=\"SUSPENSÃO\"),\"\",TEXT(G9,\"##\"\":\"\"##\"))","v":""},"","",{"$f":"IF(OR(J9=\"\",J9=0,J9=\"FALTA\",J9=\"SUSPENSO\",J9=\"SUSPENSÃO\"),\"\",TEXT(J9,\"##\"\":\"\"##\"))","v":""},{"$f":"IF(OR(K9=\"\",K9=0,K9=\"FALTA\",K9=\"SUSPENSO\",K9=\"SUSPENSÃO\"),\"\",TEXT(K9,\"##\"\":\"\"##\"))","v":""},{"$f":"IF(OR(U9=\"\",U9=0,U9=\"FALTA\",U9=\"SUSPENSO\",U9=\"SUSPENSÃO\"),\"\",TEXT(TEXT(U9,\"00\"\":\"\"00\"),\"[hh]:mm\")*1)","v":""}]
[null,null,3,{"$f":"IF(D9=\"\",\"\",IF((D9+1)>'PERIODOS E FERIADOS'!$G$6,\"\",D9+1))","v":"2023-05-02"},{"$f":"IF(D10=\"\",\"\",IF(WEEKDAY(D10,1)=1,\"Domingo\",IF(WEEKDAY(D10,1)=2,\"Segunda\",IF(WEEKDAY(D10,1)=3,\"Terça\",IF(WEEKDAY(D10,1)=4,\"Quarta\",IF(WEEKDAY(D10,1)=5,\"Quinta\",IF(WEEKDAY(D10,1)=6,\"Sexta\",IF(WEEKDAY(D10,1)=7,\"Sábado\"))))))))","v":"Terça"},null,null,null,null,null,null,null,{"$f":"IF(ISERROR(IF(OR($AF10=\"\",$AF10=0),0,(IF(TEXT($AF10,\"[hh]:mm:ss\")<TEXT($AE10,\"[hh]:mm:ss\"),(1-$AE10+$AF10),$AF10-$AE10))+IF(OR($AH10=\"\",$AH10=0),0,(IF(TEXT($AH10,\"[hh]:mm:ss\")<TEXT($AG10,\"[hh]:mm:ss\"),(1-$AG10+$AH10),$AH10-$AG10))+IF(OR($AJ10=\"\",$AJ10=0),0,(IF(TEXT($AJ10,\"[hh]:mm:ss\")<TEXT($AI10,\"[hh]:mm:ss\"),(1-$AI10+$AJ10),$AJ10-$AI10)))))),0,IF(OR($AF10=\"\",$AF10=0),0,(IF(TEXT($AF10,\"[hh]:mm:ss\")<TEXT($AE10,\"[hh]:mm:ss\"),(1-$AE10+$AF10),$AF10-$AE10))+IF(OR($AH10=\"\",$AH10=0),0,(IF(TEXT($AH10,\"[hh]:mm:ss\")<TEXT($AG10,\"[hh]:mm:ss\"),(1-$AG10+$AH10),$AH10-$AG10))+IF(OR($AJ10=\"\",$AJ10=0),0,(IF(TEXT($AJ10,\"[hh]:mm:ss\")<TEXT($AI10,\"[hh]:mm:ss\"),(1-$AI10+$AJ10),$AJ10-$AI10))))))","v":0},null,{"$f":"IF($C10=\"\",0,IF(Q10=\"Sim\",0,IF(TEXT(IF(OR((VLOOKUP($C10,$Z$8:$AB$15,3,FALSE)-$M10)<0,$AE10=\"\"),0,(VLOOKUP($C10,$Z$8:$AB$15,3,FALSE)-$M10)),\"[hh]:mm\")<=TEXT(rngTolerancia,\"[hh]:mm\"),0,IF(OR((VLOOKUP($C10,$Z$8:$AB$15,3,FALSE)-$M10)<0,$AE10=\"\"),0,(VLOOKUP($C10,$Z$8:$AB$15,3,FALSE)-$M10)))))","v":0},null,null,null,0,null,null,null,{"$f":"IF($C10=\"\",0,IF($S10<=VLOOKUP($C10,PREMISSAS!$C$6:$J$13,4,FALSE),$S10,VLOOKUP($C10,PREMISSAS!$C$6:$J$13,4,FALSE)))","v":0},null,{"$f":"IF($C10=\"\",0,IF($S10>VLOOKUP($C10,PREMISSAS!$C$6:$J$13,4,FALSE),$S10-VLOOKUP($C10,PREMISSAS!$C$6:$J$13,4,FALSE),0))","v":0},4,"QUARTA",0.33333333333333331,4,null,{"$f":"IF(OR(F10=\"\",F10=0,F10=\"FALTA\",F10=\"SUSPENSO\",F10=\"SUSPENSÃO\"),\"\",TEXT(F10,\"##\"\":\"\"##\"))","v":""},"","","","","",{"$f":"IF(OR(U10=\"\",U10=0,U10=\"FALTA\",U10=\"SUSPENSO\",U10=\"SUSPENSÃO\"),\"\",TEXT(TEXT(U10,\"00\"\":\"\"00\"),\"[hh]:mm\")*1)","v":""}]
[null,null,4,{"$f":"IF(D10=\"\",\"\",IF((D10+1)>'PERIODOS E FERIADOS'!$G$6,\"\",D10+1))","v":"2023-05-03"},"Quarta",null,null,null,null,null,null,null,0,null,0,null,null,null,0,null,null,null,{"$f":"IF($C11=\"\",0,IF($S11<=VLOOKUP($C11,PREMISSAS!$C$6:$J$13,4,FALSE),$S11,VLOOKUP($C11,PREMISSAS!$C$6:$J$13,4,FALSE)))","v":0},null,{"$f":"IF($C11=\"\",0,IF($S11>VLOOKUP($C11,PREMISSAS!$C$6:$J$13,4,FALSE),$S11-VLOOKUP($C11,PREMISSAS!$C$6:$J$13,4,FALSE),0))","v":0},5,"QUINTA",0.33333333333333331,5,null,"","","","","","",""]
[null,null,5,{"$f":"IF(D11=\"\",\"\",IF((D11+1)>'PERIODOS E FERIADOS'!$G$6,\"\",D11+1))","v":"2023-05-04"},"Quinta",null,null,null,null,null,null,null,0,null,0,null,null,null,0,null,null,null,{"$f":"IF($C12=\"\",0,IF($S12<=VLOOKUP($C12,PREMISSAS!$C$6:$J$13,4,FALSE),$S12,VLOOKUP($C12,PREMISSAS!$C$6:$J$13,4,FALSE)))","v":0},null,{"$f":"IF($C12=\"\",0,IF($S12>VLOOKUP($C12,PREMISSAS!$C$6:$J$13,4,FALSE),$S12-VLOOKUP($C12,PREMISSAS!$C$6:$J$13,4,FALSE),0))","v":0},6,"SEXTA",0.33333333333333331,6,null,"","","","","","",{"$f":"IF(OR(U12=\"\",U12=0,U12=\"FALTA\",U12=\"SUSPENSO\",U12=\"SUSPENSÃO\"),\"\",TEXT(TEXT(U12,\"##\"\":\"\"##\"),\"[hh]:mm\")*1)","v":""}]
[null,null,6,{"$f":"IF(D12=\"\",\"\",IF((D12+1)>'PERIODOS E FERIADOS'!$G$6,\"\",D12+1))","v":"2023-05-05"},"Sexta",null,null,null,null,null,null,null,0,null,0,null,null,null,0,null,null,null,{"$f":"IF($C13=\"\",0,IF($S13<=VLOOKUP($C13,PREMISSAS!$C$6:$J$13,4,FALSE),$S13,VLOOKUP($C13,PREMISSAS!$C$6:$J$13,4,FALSE)))","v":0},null,{"$f":"IF($C13=\"\",0,IF($S13>VLOOKUP($C13,PREMISSAS!$C$6:$J$13,4,FALSE),$S13-VLOOKUP($C13,PREMISSAS!$C$6:$J$13,4,FALSE),0))","v":0},7,"SÁBADO",0.16666666666666666,7,null,"","","","","","",""]
[null,null,7,{"$f":"IF(D13=\"\",\"\",IF((D13+1)>'PERIODOS E FERIADOS'!$G$6,\"\",D13+1))","v":"2023-05-06"},"Sábado",null,null,null,null,null,null,null,0,null,0,null,null,null,0,null,null,null,{"$f":"IF($C14=\"\",0,IF($S14<=VLOOKUP($C14,PREMISSAS!$C$6:$J$13,4,FALSE),$S14,VLOOKUP($C14,PREMISSAS!$C$6:$J$13,4,FALSE)))","v":0},null,{"$f":"IF($C14=\"\",0,IF($S14>VLOOKUP($C14,PREMISSAS!$C$6:$J$13,4,FALSE),$S14-VLOOKUP($C14,PREMISSAS!$C$6:$J$13,4,FALSE),0))","v":0},1,"DOMINGO",0,1,null,"","","","","","",""]
[null,null,1,{"$f":"IF(D14=\"\",\"\",IF((D14+1)>'PERIODOS E FERIADOS'!$G$6,\"\",D14+1))","v":"2023-05-07"},"Domingo",null,null,null,null,null,null,null,0,null,0,null,null,null,0,null,null,null,{"$f":"IF($C15=\"\",0,IF($S15<=VLOOKUP($C15,PREMISSAS!$C$6:$J$13,4,FALSE),$S15,VLOOKUP($C15,PREMISSAS!$C$6:$J$13,4,FALSE)))","v":0},null,{"$f":"IF($C15=\"\",0,IF($S15>VLOOKUP($C15,PREMISSAS!$C$6:$J$13,4,FALSE),$S15-VLOOKUP($C15,PREMISSAS!$C$6:$J$13,4,FALSE),0))","v":0},"F","FERIADOS",0,"F",null,"","","","","","",""]
[null,null,2,{"$f":"IF(D15=\"\",\"\",IF((D15+1)>'PERIODOS E FERIADOS'!$G$6,\"\",D15+1))","v":"2023-05-08"},"Segunda",null,null,null,null,null,null,null,0,null,0,null,null,null,0,null,null,null,{"$f":"IF($C16=\"\",0,IF($S16<=VLOOKUP($C16,PREMISSAS!$C$6:$J$13,4,FALSE),$S16,VLOOKUP($C16,PREMISSAS!$C$6:$J$13,4,FALSE)))","v":0},null,{"$f":"IF($C16=\"\",0,IF($S16>VLOOKUP($C16,PREMISSAS!$C$6:$J$13,4,FALSE),$S16-VLOOKUP($C16,PREMISSAS!$C$6:$J$13,4,FALSE),0))","v":0},null,"TOTAL SEMANA",{"$f":"SUM(AB8:AB15)","v":1.8333333333333333},null,null,"","","","","","",""]
[null,null,3,{"$f":"IF(D16=\"\",\"\",IF((D16+1)>'PERIODOS E FERIADOS'!$G$6,\"\",D16+1))","v":"2023-05-09"},"Terça",null,null,null,null,null,null,null,0,null,0,null,null,null,0,null,null,null,{"$f":"IF($C17=\"\",0,IF($S17<=VLOOKUP($C17,PREMISSAS!$C$6:$J$13,4,FALSE),$S17,VLOOKUP($C17,PREMISSAS!$C$6:$J$13,4,FALSE)))","v":0},null,{"$f":"IF($C17=\"\",0,IF($S17>VLOOKUP($C17,PREMISSAS!$C$6:$J$13,4,FALSE),$S17-VLOOKUP($C17,PREMISSAS!$C$6:$J$13,4,FALSE),0))","v":0},null,"JORNADA MENSAL",{"$f":"AB16*5","v":9.1666666666666661},null,null,"","","","","","",""]
[null,null,4,{"$f":"IF(D17=\"\",\"\",IF((D17+1)>'PERIODOS E FERIADOS'!$G$6,\"\",D17+1))","v":"2023-05-10"},"Quarta",null,null,null,null,null,null,null,0,null,0,null,null,null,0,null,null,null,{"$f":"IF($C18=\"\",0,IF($S18<=VLOOKUP($C18,PREMISSAS!$C$6:$J$13,4,FALSE),$S18,VLOOKUP($C18,PREMISSAS!$C$6:$J$13,4,FALSE)))","v":0},null,{"$f":"IF($C18=\"\",0,IF($S18>VLOOKUP($C18,PREMISSAS!$C$6:$J$13,4,FALSE),$S18-VLOOKUP($C18,PREMISSAS!$C$6:$J$13,4,FALSE),0))","v":0},null,null,null,null,null,"","","","","","",""]
[null,null,5,{"$f":"IF(D18=\"\",\"\",IF((D18+1)>'PERIODOS E FERIADOS'!$G$6,\"\",D18+1))","v":"2023-05-11"},"Quinta",null,null,null,null,null,null,null,0,null,0,null,null,null,0,null,null,null,{"$f":"IF($C19=\"\",0,IF($S19<=VLOOKUP($C19,PREMISSAS!$C$6:$J$13,4,FALSE),$S19,VLOOKUP($C19,PREMISSAS!$C$6:$J$13,4,FALSE)))","v":0},null,{"$f":"IF($C19=\"\",0,IF($S19>VLOOKUP($C19,PREMISSAS!$C$6:$J$13,4,FALSE),$S19-VLOOKUP($C19,PREMISSAS!$C$6:$J$13,4,FALSE),0))","v":0},null,{"$f":"IF(AB$16>AB$23,\"Jornada Superior a permitida\",IF(AB$16<=AB$23,\"\"))","v":""},null,null,null,"","","","","","",""]
[null,null,6,{"$f":"IF(D19=\"\",\"\",IF((D19+1)>'PERIODOS E FERIADOS'!$G$6,\"\",D19+1))","v":"2023-05-12"},"Sexta",null,null,null,null,null,null,null,0,null,0,null,null,null,0,null,null,null,{"$f":"IF($C20=\"\",0,IF($S20<=VLOOKUP($C20,PREMISSAS!$C$6:$J$13,4,FALSE),$S20,VLOOKUP($C20,PREMISSAS!$C$6:$J$13,4,FALSE)))","v":0},null,{"$f":"IF($C20=\"\",0,IF($S20>VLOOKUP($C20,PREMISSAS!$C$6:$J$13,4,FALSE),$S20-VLOOKUP($C20,PREMISSAS!$C$6:$J$13,4,FALSE),0))","v":0},null,{"$f":"IF(AB$16>AB$23,\"\",IF(AB$16<=AB$23,\"Jornada Ok\"))","v":"Jornada Ok"},null,null,null,"","","","","","",""]
[null,null,7,{"$f":"IF(D20=\"\",\"\",IF((D20+1)>'PERIODOS E FERIADOS'!$G$6,\"\",D20+1))","v":"2023-05-13"},"Sábado",null,null,null,null,null,null,null,0,null,0,null,null,null,0,null,null,null,{"$f":"IF($C21=\"\",0,IF($S21<=VLOOKUP($C21,PREMISSAS!$C$6:$J$13,4,FALSE),$S21,VLOOKUP($C21,PREMISSAS!$C$6:$J$13,4,FALSE)))","v":0},null,{"$f":"IF($C21=\"\",0,IF($S21>VLOOKUP($C21,PREMISSAS!$C$6:$J$13,4,FALSE),$S21-VLOOKUP($C21,PREMISSAS!$C$6:$J$13,4,FALSE),0))","v":0},null,null,null,null,null,"","","","","","",""]
[null,null,1,{"$f":"IF(D21=\"\",\"\",IF((D21+1)>'PERIODOS E FERIADOS'!$G$6,\"\",D21+1))","v":"2023-05-14"},"Domingo",null,null,null,null,null,null,null,0,null,0,null,null,null,0,null,null,null,{"$f":"IF($C22=\"\",0,IF($S22<=VLOOKUP($C22,PREMISSAS!$C$6:$J$13,4,FALSE),$S22,VLOOKUP($C22,PREMISSAS!$C$6:$J$13,4,FALSE)))","v":0},null,{"$f":"IF($C22=\"\",0,IF($S22>VLOOKUP($C22,PREMISSAS!$C$6:$J$13,4,FALSE),$S22-VLOOKUP($C22,PREMISSAS!$C$6:$J$13,4,FALSE),0))","v":0},null,null,null,null,null,"","","","","","",""]
[null,null,2,{"$f":"IF(D22=\"\",\"\",IF((D22+1)>'PERIODOS E FERIADOS'!$G$6,\"\",D22+1))","v":"2023-05-15"},"Segunda",null,null,null,null,null,null,null,0,null,0,null,null,null,0,null,null,null,{"$f":"IF($C23=\"\",0,IF($S23<=VLOOKUP($C23,PREMISSAS!$C$6:$J$13,4,FALSE),$S23,VLOOKUP($C23,PREMISSAS!$C$6:$J$13,4,FALSE)))","v":0},null,{"$f":"IF($C23=\"\",0,IF($S23>VLOOKUP($C23,PREMISSAS!$C$6:$J$13,4,FALSE),$S23-VLOOKUP($C23,PREMISSAS!$C$6:$J$13,4,FALSE),0))","v":0},null,"Jornada Maxima",1.8333333333333333,null,null,"","","","","","",""]
[null,null,3,{"$f":"IF(D23=\"\",\"\",IF((D23+1)>'PERIODOS E FERIADOS'!$G$6,\"\",D23+1))","v":"2023-05-16"},"Terça",null,null,null,null,null,null,null,0,null,0,null,null,null,0,null,null,null,{"$f":"IF($C24=\"\",0,IF($S24<=VLOOKUP($C24,PREMISSAS!$C$6:$J$13,4,FALSE),$S24,VLOOKUP($C24,PREMISSAS!$C$6:$J$13,4,FALSE)))","v":0},null,{"$f":"IF($C24=\"\",0,IF($S24>VLOOKUP($C24,PREMISSAS!$C$6:$J$13,4,FALSE),$S24-VLOOKUP($C24,PREMISSAS!$C$6:$J$13,4,FALSE),0))","v":0},null,null,null,null,null,"","","","","","",""]
[null,null,4,{"$f":"IF(D24=\"\",\"\",IF((D24+1)>'PERIODOS E FERIADOS'!$G$6,\"\",D24+1))","v":"2023-05-17"},"Quarta",null,null,null,null,null,null,null,0,null,0,null,null,null,0,null,null,null,{"$f":"IF($C25=\"\",0,IF($S25<=VLOOKUP($C25,PREMISSAS!$C$6:$J$13,4,FALSE),$S25,VLOOKUP($C25,PREMISSAS!$C$6:$J$13,4,FALSE)))","v":0},null,{"$f":"IF($C25=\"\",0,IF($S25>VLOOKUP($C25,PREMISSAS!$C$6:$J$13,4,FALSE),$S25-VLOOKUP($C25,PREMISSAS!$C$6:$J$13,4,FALSE),0))","v":0},null,null,null,null,null,"","","","","","",""]
[null,null,5,{"$f":"IF(D25=\"\",\"\",IF((D25+1)>'PERIODOS E FERIADOS'!$G$6,\"\",D25+1))","v":"2023-05-18"},"Quinta",null,null,null,null,null,null,null,0,null,0,null,null,null,0,null,null,null,{"$f":"IF($C26=\"\",0,IF($S26<=VLOOKUP($C26,PREMISSAS!$C$6:$J$13,4,FALSE),$S26,VLOOKUP($C26,PREMISSAS!$C$6:$J$13,4,FALSE)))","v":0},null,{"$f":"IF($C26=\"\",0,IF($S26>VLOOKUP($C26,PREMISSAS!$C$6:$J$13,4,FALSE),$S26-VLOOKUP($C26,PREMISSAS!$C$6:$J$13,4,FALSE),0))","v":0},null,null,null,null,null,"","","","","","",""]
[null,null,6,{"$f":"IF(D26=\"\",\"\",IF((D26+1)>'PERIODOS E FERIADOS'!$G$6,\"\",D26+1))","v":"2023-05-19"},"Sexta",null,null,null,null,null,null,null,0,null,0,null,null,null,0,null,null,null,{"$f":"IF($C27=\"\",0,IF($S27<=VLOOKUP($C27,PREMISSAS!$C$6:$J$13,4,FALSE),$S27,VLOOKUP($C27,PREMISSAS!$C$6:$J$13,4,FALSE)))","v":0},null,{"$f":"IF($C27=\"\",0,IF($S27>VLOOKUP($C27,PREMISSAS!$C$6:$J$13,4,FALSE),$S27-VLOOKUP($C27,PREMISSAS!$C$6:$J$13,4,FALSE),0))","v":0},null,null,null,null,null,"","","","","","",""]
[null,null,7,{"$f":"IF(D27=\"\",\"\",IF((D27+1)>'PERIODOS E FERIADOS'!$G$6,\"\",D27+1))","v":"2023-05-20"},"Sábado",null,null,null,null,null,null,null,0,null,0,null,null,null,0,null,null,null,{"$f":"IF($C28=\"\",0,IF($S28<=VLOOKUP($C28,PREMISSAS!$C$6:$J$13,4,FALSE),$S28,VLOOKUP($C28,PREMISSAS!$C$6:$J$13,4,FALSE)))","v":0},null,{"$f":"IF($C28=\"\",0,IF($S28>VLOOKUP($C28,PREMISSAS!$C$6:$J$13,4,FALSE),$S28-VLOOKUP($C28,PREMISSAS!$C$6:$J$13,4,FALSE),0))","v":0},null,null,null,null,null,"","","","","","",""]
[null,null,1,{"$f":"IF(D28=\"\",\"\",IF((D28+1)>'PERIODOS E FERIADOS'!$G$6,\"\",D28+1))","v":"2023-05-21"},"Domingo",null,null,null,null,null,null,null,0,null,0,null,null,null,0,null,null,null,{"$f":"IF($C29=\"\",0,IF($S29<=VLOOKUP($C29,PREMISSAS!$C$6:$J$13,4,FALSE),$S29,VLOOKUP($C29,PREMISSAS!$C$6:$J$13,4,FALSE)))","v":0},null,{"$f":"IF($C29=\"\",0,IF($S29>VLOOKUP($C29,PREMISSAS!$C$6:$J$13,4,FALSE),$S29-VLOOKUP($C29,PREMISSAS!$C$6:$J$13,4,FALSE),0))","v":0},null,null,null,null,null,"","","","","","",""]
[null,null,2,{"$f":"IF(D29=\"\",\"\",IF((D29+1)>'PERIODOS E FERIADOS'!$G$6,\"\",D29+1))","v":"2023-05-22"},"Segunda",null,null,null,null,null,null,null,0,null,0,null,null,null,0,null,null,null,{"$f":"IF($C30=\"\",0,IF($S30<=VLOOKUP($C30,PREMISSAS!$C$6:$J$13,4,FALSE),$S30,VLOOKUP($C30,PREMISSAS!$C$6:$J$13,4,FALSE)))","v":0},null,{"$f":"IF($C30=\"\",0,IF($S30>VLOOKUP($C30,PREMISSAS!$C$6:$J$13,4,FALSE),$S30-VLOOKUP($C30,PREMISSAS!$C$6:$J$13,4,FALSE),0))","v":0},null,null,null,null,null,"","","","","","",""]
[null,null,3,{"$f":"IF(D30=\"\",\"\",IF((D30+1)>'PERIODOS E FERIADOS'!$G$6,\"\",D30+1))","v":"2023-05-23"},"Terça",null,null,null,null,null,null,null,0,null,0,null,null,null,0,null,null,null,{"$f":"IF($C31=\"\",0,IF($S31<=VLOOKUP($C31,PREMISSAS!$C$6:$J$13,4,FALSE),$S31,VLOOKUP($C31,PREMISSAS!$C$6:$J$13,4,FALSE)))","v":0},null,{"$f":"IF($C31=\"\",0,IF($S31>VLOOKUP($C31,PREMISSAS!$C$6:$J$13,4,FALSE),$S31-VLOOKUP($C31,PREMISSAS!$C$6:$J$13,4,FALSE),0))","v":0},null,null,null,null,null,"","","","","","",""]
[null,null,4,{"$f":"IF(D31=\"\",\"\",IF((D31+1)>'PERIODOS E FERIADOS'!$G$6,\"\",D31+1))","v":"2023-05-24"},"Quarta",null,null,null,null,null,null,null,0,null,0,null,null,null,0,null,null,null,{"$f":"IF($C32=\"\",0,IF($S32<=VLOOKUP($C32,PREMISSAS!$C$6:$J$13,4,FALSE),$S32,VLOOKUP($C32,PREMISSAS!$C$6:$J$13,4,FALSE)))","v":0},null,{"$f":"IF($C32=\"\",0,IF($S32>VLOOKUP($C32,PREMISSAS!$C$6:$J$13,4,FALSE),$S32-VLOOKUP($C32,PREMISSAS!$C$6:$J$13,4,FALSE),0))","v":0},null,null,null,null,null,{"$f":"IF(OR(F32=\"\",F32=0,F32=\"FALTA\",F32=\"SUSPENSO\",F32=\"SUSPENSÃO\"),\"\",TEXT(F32,\"##\"\":\"\"##\"))","v":""},{"$f":"IF(OR(G32=\"\",G32=0,G32=\"FALTA\",G32=\"SUSPENSO\",G32=\"SUSPENSÃO\"),\"\",TEXT(G32,\"##\"\":\"\"##\"))","v":""},"","",{"$f":"IF(OR(J32=\"\",J32=0,J32=\"FALTA\",J32=\"SUSPENSO\",J32=\"SUSPENSÃO\"),\"\",TEXT(J32,\"##\"\":\"\"##\"))","v":""},{"$f":"IF(OR(K32=\"\",K32=0,K32=\"FALTA\",K32=\"SUSPENSO\",K32=\"SUSPENSÃO\"),\"\",TEXT(K32,\"##\"\":\"\"##\"))","v":""},""]
[null,null,5,{"$f":"IF(D32=\"\",\"\",IF((D32+1)>'PERIODOS E FERIADOS'!$G$6,\"\",D32+1))","v":"2023-05-25"},"Quinta",null,null,null,null,null,null,null,0,null,0,null,null,null,0,null,null,null,{"$f":"IF($C33=\"\",0,IF($S33<=VLOOKUP($C33,PREMISSAS!$C$6:$J$13,4,FALSE),$S33,VLOOKUP($C33,PREMISSAS!$C$6:$J$13,4,FALSE)))","v":0},null,{"$f":"IF($C33=\"\",0,IF($S33>VLOOKUP($C33,PREMISSAS!$C$6:$J$13,4,FALSE),$S33-VLOOKUP($C33,PREMISSAS!$C$6:$J$13,4,FALSE),0))","v":0},null,null,null,null,null,{"$f":"IF(OR(F33=\"\",F33=0,F33=\"FALTA\",F33=\"SUSPENSO\",F33=\"SUSPENSÃO\"),\"\",TEXT(F33,\"##\"\":\"\"##\"))","v":""},"","","","","",""]
[null,null,6,{"$f":"IF(D33=\"\",\"\",IF((D33+1)>'PERIODOS E FERIADOS'!$G$6,\"\",D33+1))","v":"2023-05-26"},"Sexta",null,null,null,null,null,null,null,0,null,0,null,null,null,0,null,null,null,{"$f":"IF($C34=\"\",0,IF($S34<=VLOOKUP($C34,PREMISSAS!$C$6:$J$13,4,FALSE),$S34,VLOOKUP($C34,PREMISSAS!$C$6:$J$13,4,FALSE)))","v":0},null,{"$f":"IF($C34=\"\",0,IF($S34>VLOOKUP($C34,PREMISSAS!$C$6:$J$13,4,FALSE),$S34-VLOOKUP($C34,PREMISSAS!$C$6:$J$13,4,FALSE),0))","v":0},null,null,null,null,null,"","","","","","",""]
[null,null,7,{"$f":"IF(D34=\"\",\"\",IF((D34+1)>'PERIODOS E FERIADOS'!$G$6,\"\",D34+1))","v":"2023-05-27"},"Sábado",null,null,null,null,null,null,null,0,null,0,null,null,null,0,null,null,null,{"$f":"IF($C35=\"\",0,IF($S35<=VLOOKUP($C35,PREMISSAS!$C$6:$J$13,4,FALSE),$S35,VLOOKUP($C35,PREMISSAS!$C$6:$J$13,4,FALSE)))","v":0},null,{"$f":"IF($C35=\"\",0,IF($S35>VLOOKUP($C35,PREMISSAS!$C$6:$J$13,4,FALSE),$S35-VLOOKUP($C35,PREMISSAS!$C$6:$J$13,4,FALSE),0))","v":0},null,null,null,null,null,"","","","","","",""]
[null,null,1,{"$f":"IF(D35=\"\",\"\",IF((D35+1)>'PERIODOS E FERIADOS'!$G$6,\"\",D35+1))","v":"2023-05-28"},"Domingo",null,null,null,null,null,null,null,0,null,0,null,null,null,0,null,null,null,{"$f":"IF($C36=\"\",0,IF($S36<=VLOOKUP($C36,PREMISSAS!$C$6:$J$13,4,FALSE),$S36,VLOOKUP($C36,PREMISSAS!$C$6:$J$13,4,FALSE)))","v":0},null,{"$f":"IF($C36=\"\",0,IF($S36>VLOOKUP($C36,PREMISSAS!$C$6:$J$13,4,FALSE),$S36-VLOOKUP($C36,PREMISSAS!$C$6:$J$13,4,FALSE),0))","v":0},null,null,null,null,null,"","","","","","",""]
[null,null,2,{"$f":"IF(D36=\"\",\"\",IF((D36+1)>'PERIODOS E FERIADOS'!$G$6,\"\",D36+1))","v":"2023-05-29"},"Segunda",null,null,null,null,null,null,null,0,null,0,null,null,null,0,null,null,null,{"$f":"IF($C37=\"\",0,IF($S37<=VLOOKUP($C37,PREMISSAS!$C$6:$J$13,4,FALSE),$S37,VLOOKUP($C37,PREMISSAS!$C$6:$J$13,4,FALSE)))","v":0},null,{"$f":"IF($C37=\"\",0,IF($S37>VLOOKUP($C37,PREMISSAS!$C$6:$J$13,4,FALSE),$S37-VLOOKUP($C37,PREMISSAS!$C$6:$J$13,4,FALSE),0))","v":0},null,null,null,null,null,"","","","","","",""]
[null,null,3,{"$f":"IF(D37=\"\",\"\",IF((D37+1)>'PERIODOS E FERIADOS'!$G$6,\"\",D37+1))","v":"2023-05-30"},"Terça",null,null,null,null,null,null,null,0,null,0,null,null,null,0,null,null,null,{"$f":"IF($C38=\"\",0,IF($S38<=VLOOKUP($C38,PREMISSAS!$C$6:$J$13,4,FALSE),$S38,VLOOKUP($C38,PREMISSAS!$C$6:$J$13,4,FALSE)))","v":0},null,{"$f":"IF($C38=\"\",0,IF($S38>VLOOKUP($C38,PREMISSAS!$C$6:$J$13,4,FALSE),$S38-VLOOKUP($C38,PREMISSAS!$C$6:$J$13,4,FALSE),0))","v":0},null,null,null,null,null,"","","","","","",""]
[null,null,4,{"$f":"IF(D38=\"\",\"\",IF((D38+1)>'PERIODOS E FERIADOS'!$G$6,\"\",D38+1))","v":"2023-05-31"},"Quarta",null,null,null,null,null,null,null,0,null,0,null,null,null,0,null,null,null,{"$f":"IF($C39=\"\",0,IF($S39<=VLOOKUP($C39,PREMISSAS!$C$6:$J$13,4,FALSE),$S39,VLOOKUP($C39,PREMISSAS!$C$6:$J$13,4,FALSE)))","v":0},null,{"$f":"IF($C39=\"\",0,IF($S39>VLOOKUP($C39,PREMISSAS!$C$6:$J$13,4,FALSE),$S39-VLOOKUP($C39,PREMISSAS!$C$6:$J$13,4,FALSE),0))","v":0},null,null,null,null,null,"","","","","","",""]
[]
[null,null,null,"TOTAIS",null,null,"Faltas / Suspensão",null,{"$f":"COUNTIF($F$9:$F$39,\"FALTA\")+COUNTIF($F$9:$F$39,\"SUSPENSÃO\")+COUNTIF($F$9:$F$39,\"SUSPENSO\")+COUNTIF($F$9:$F$39,\"SUSPENSAO\")","v":0},null,null,null,{"$f":"SUM($M$9:$M$39)","v":0},null,{"$f":"SUM($O$9:$O$39)","v":0},null,null,null,{"$f":"SUM(S$9:S$39)","v":0},null,{"$f":"$AK$41","v":0},null,{"$f":"SUM(W$9:W$39)","v":0},null,{"$f":"SUM(Y$9:Y$39)","v":0},null,null,null,null,null,null,null,null,null,null,null,{"$f":"SUM(AK9:AK39)","v":0}]
[]
[null,null,null,"OBSERVAÇÕES:"]

{"sheet":"FUNC 6","index":10,"n_rows":43,"n_cols":37,"rows_kept":43,"cut":false,"hidden":false,"merged":[[5,30,5,33],[40,3,40,5],[40,6,40,7],[40,8,40,10],[42,3,43,24],[18,26,18,27],[19,26,19,27],[3,3,4,27],[5,3,5,4],[5,5,5,10],[5,12,5,20],[5,22,5,24],[5,26,5,27]]}
[]
[]
[]
[null,null,null,{"$f":"'PERIODOS E FERIADOS'!$E$5","v":0}]
[]
[null,null,null,"Funcionário",null,{"$f":"FUNCIONÁRIOS!E10","v":6},null,null,null,null,null,null,"H.E. / Atrasos / A.N",null,null,null,null,null,null,null,null,null,"Distrib. H.E. p/ Faixa",null,null,null,"CARGA HORÁRIA",null,null,null,"ESPELHO"]
[]
[null,null,null,"Data","Dia Semana","Entrada","Saída","Entrada","Saída","Entrada","Saída",null,"H. Diária",null,"Atrasos",null,"Abona",null,"Horas Extras",null,"Adc. Noturno",null,{"$f":"PREMISSAS!H6","v":0.5},null,{"$f":"PREMISSAS!H12","v":1},2,"SEGUNDA",0.33333333333333331,2,null,"Entrada","Saída","Entrada","Saída","Entrada","Saída","AN "]
[null,null,{"$f":"IF(NOT(ISERROR(VLOOKUP(D9,rngFeriados,1,FALSE))),\"F\",IF(D9=\"\",\"\",WEEKDAY($D9,1)))","v":"F"},{"$f":"'PERIODOS E FERIADOS'!$E$6","v":"2023-05-01"},{"$f":"IF(D9=\"\",\"\",IF(WEEKDAY(D9,1)=1,\"Domingo\",IF(WEEKDAY(D9,1)=2,\"Segunda\",IF(WEEKDAY(D9,1)=3,\"Terça\",IF(WEEKDAY(D9,1)=4,\"Quarta\",IF(WEEKDAY(D9,1)=5,\"Quinta\",IF(WEEKDAY(D9,1)=6,\"Sexta\",IF(WEEKDAY(D9,1)=7,\"Sábado\"))))))))","v":"Segunda"},null,null,null,null,null,null,null,{"$f":"IF(ISERROR(IF(OR($AF9=\"\",$AF9=0),0,(IF(TEXT($AF9,\"[hh]:mm:ss\")<TEXT($AE9,\"[hh]:mm:ss\"),(1-$AE9+$AF9),$AF9-$AE9))+IF(OR($AH9=\"\",$AH9=0),0,(IF(TEXT($AH9,\"[hh]:mm:ss\")<TEXT($AG9,\"[hh]:mm:ss\"),(1-$AG9+$AH9),$AH9-$AG9))+IF(OR($AJ9=\"\",$AJ9=0),0,(IF(TEXT($AJ9,\"[hh]:mm:ss\")<TEXT($AI9,\"[hh]:mm:ss\"),(1-$AI9+$AJ9),$AJ9-$AI9)))))),0,IF(OR($AF9=\"\",$AF9=0),0,(IF(TEXT($AF9,\"[hh]:mm:ss\")<TEXT($AE9,\"[hh]:mm:ss\"),(1-$AE9+$AF9),$AF9-$AE9))+IF(OR($AH9=\"\",$AH9=0),0,(IF(TEXT($AH9,\"[hh]:mm:ss\")<TEXT($AG9,\"[hh]:mm:ss\"),(1-$AG9+$AH9),$AH9-$AG9))+IF(OR($AJ9=\"\",$AJ9=0),0,(IF(TEXT($AJ9,\"[hh]:mm:ss\")<TEXT($AI9,\"[hh]:mm:ss\"),(1-$AI9+$AJ9),$AJ9-$AI9))))))","v":0},null,{"$f":"IF($C9=\"\",0,IF(Q9=\"Sim\",0,IF(TEXT(IF(OR((VLOOKUP($C9,$Z$8:$AB$15,3,FALSE)-$M9)<0,$AE9=\"\"),0,(VLOOKUP($C9,$Z$8:$AB$15,3,FALSE)-$M9)),\"[hh]:mm\")<=TEXT(rngTolerancia,\"[hh]:mm\"),0,IF(OR((VLOOKUP($C9,$Z$8:$AB$15,3,FALSE)-$M9)<0,$AE9=\"\"),0,(VLOOKUP($C9,$Z$8:$AB$15,3,FALSE)-$M9)))))","v":0},null,null,null,{"$f":"IF($C9=\"\",0,IF(TEXT(IF(($M9-VLOOKUP($C9,$Z$8:$AB$15,3,FALSE))<0,0,($M9-VLOOKUP($C9,$Z$8:$AB$15,3,FALSE))),\"[hh]:mm\")<=TEXT(rngTolerancia,\"[hh]:mm\"),0,IF(($M9-VLOOKUP($C9,$Z$8:$AB$15,3,FALSE))<0,0,($M9-VLOOKUP($C9,$Z$8:$AB$15,3,FALSE)))))","v":0},null,null,null,{"$f":"IF($C9=\"\",0,IF($S9<=VLOOKUP($C9,PREMISSAS!$C$6:$J$13,4,FALSE),$S9,VLOOKUP($C9,PREMISSAS!$C$6:$J$13,4,FALSE)))","v":0},null,{"$f":"IF($C9=\"\",0,IF($S9>VLOOKUP($C9,PREMISSAS!$C$6:$J$13,4,FALSE),$S9-VLOOKUP($C9,PREMISSAS!$C$6:$J$13,4,FALSE),0))","v":0},3,"TERÇA",0.33333333333333331,3,null,{"$f":"IF(OR(F9=\"\",F9=0,F9=\"FALTA\",F9=\"SUSPENSO\",F9=\"SUSPENSÃO\"),\"\",TEXT(F9,\"##\"\":\"\"##\"))","v":""},{"$f":"IF(OR(G9=\"\",G9=0,G9=\"FALTA\",G9=\"SUSPENSO\",G9=\"SUSPENSÃO\"),\"\",TEXT(G9,\"##\"\":\"\"##\"))","v":""},"","",{"$f":"IF(OR(J9=\"\",J9=0,J9=\"FALTA\",J9=\"SUSPENSO\",J9=\"SUSPENSÃO\"),\"\",TEXT(J9,\"##\"\":\"\"##\"))","v":""},{"$f":"IF(OR(K9=\"\",K9=0,K9=\"FALTA\",K9=\"SUSPENSO\",K9=\"SUSPENSÃO\"),\"\",TEXT(K9,\"##\"\":\"\"##\"))","v":""},{"$f":"IF(OR(U9=\"\",U9=0,U9=\"FALTA\",U9=\"SUSPENSO\",U9=\"SUSPENSÃO\"),\"\",TEXT(TEXT(U9,\"00\"\":\"\"00\"),\"[hh]:mm\")*1)","v":""}]
[null,null,3,{"$f":"IF(D9=\"\",\"\",IF((D9+1)>'PERIODOS E FERIADOS'!$G$6,\"\",D9+1))","v":"2023-05-02"},{"$f":"IF(D10=\"\",\"\",IF(WEEKDAY(D10,1)=1,\"Domingo\",IF(WEEKDAY(D10,1)=2,\"Segunda\",IF(WEEKDAY(D10,1)=3,\"Terça\",IF(WEEKDAY(D10,1)=4,\"Quarta\",IF(WEEKDAY(D10,1)=5,\"Quinta\",IF(WEEKDAY(D10,1)=6,\"Sexta\",IF(WEEKDAY(D10,1)=7,\"Sábado\"))))))))","v":"Terça"},null,null,null,null,null,null,null,{"$f":"IF(ISERROR(IF(OR($AF10=\"\",$AF10=0),0,(IF(TEXT($AF10,\"[hh]:mm:ss\")<TEXT($AE10,\"[hh]:mm:ss\"),(1-$AE10+$AF10),$AF10-$AE10))+IF(OR($AH10=\"\",$AH10=0),0,(IF(TEXT($AH10,\"[hh]:mm:ss\")<TEXT($AG10,\"[hh]:mm:ss\"),(1-$AG10+$AH10),$AH10-$AG10))+IF(OR($AJ10=\"\",$AJ10=0),0,(IF(TEXT($AJ10,\"[hh]:mm:ss\")<TEXT($AI10,\"[hh]:mm:ss\"),(1-$AI10+$AJ10),$AJ10-$AI10)))))),0,IF(OR($AF10=\"\",$AF10=0),0,(IF(TEXT($AF10,\"[hh]:mm:ss\")<TEXT($AE10,\"[hh]:mm:ss\"),(1-$AE10+$AF10),$AF10-$AE10))+IF(OR($AH10=\"\",$AH10=0),0,(IF(TEXT($AH10,\"[hh]:mm:ss\")<TEXT($AG10,\"[hh]:mm:ss\"),(1-$AG10+$AH10),$AH10-$AG10))+IF(OR($AJ10=\"\",$AJ10=0),0,(IF(TEXT($AJ10,\"[hh]:mm:ss\")<TEXT($AI10,\"[hh]:mm:ss\"),(1-$AI10+$AJ10),$AJ10-$AI10))))))","v":0},null,{"$f":"IF($C10=\"\",0,IF(Q10=\"Sim\",0,IF(TEXT(IF(OR((VLOOKUP($C10,$Z$8:$AB$15,3,FALSE)-$M10)<0,$AE10=\"\"),0,(VLOOKUP($C10,$Z$8:$AB$15,3,FALSE)-$M10)),\"[hh]:mm\")<=TEXT(rngTolerancia,\"[hh]:mm\"),0,IF(OR((VLOOKUP($C10,$Z$8:$AB$15,3,FALSE)-$M10)<0,$AE10=\"\"),0,(VLOOKUP($C10,$Z$8:$AB$15,3,FALSE)-$M10)))))","v":0},null,null,null,0,null,null,null,{"$f":"IF($C10=\"\",0,IF($S10<=VLOOKUP($C10,PREMISSAS!$C$6:$J$13,4,FALSE),$S10,VLOOKUP($C10,PREMISSAS!$C$6:$J$13,4,FALSE)))","v":0},null,{"$f":"IF($C10=\"\",0,IF($S10>VLOOKUP($C10,PREMISSAS!$C$6:$J$13,4,FALSE),$S10-VLOOKUP($C10,PREMISSAS!$C$6:$J$13,4,FALSE),0))","v":0},4,"QUARTA",0.33333333333333331,4,null,{"$f":"IF(OR(F10=\"\",F10=0,F10=\"FALTA\",F10=\"SUSPENSO\",F10=\"SUSPENSÃO\"),\"\",TEXT(F10,\"##\"\":\"\"##\"))","v":""},"","","","","",{"$f":"IF(OR(U10=\"\",U10=0,U10=\"FALTA\",U10=\"SUSPENSO\",U10=\"SUSPENSÃO\"),\"\",TEXT(TEXT(U10,\"00\"\":\"\"00\"),\"[hh]:mm\")*1)","v":""}]
[null,null,4,{"$f":"IF(D10=\"\",\"\",IF((D10+1)>'PERIODOS E FERIADOS'!$G$6,\"\",D10+1))","v":"2023-05-03"},"Quarta",null,null,null,null,null,null,null,0,null,0,null,null,null,0,null,null,null,{"$f":"IF($C11=\"\",0,IF($S11<=VLOOKUP($C11,PREMISSAS!$C$6:$J$13,4,FALSE),$S11,VLOOKUP($C11,PREMISSAS!$C$6:$J$13,4,FALSE)))","v":0},null,{"$f":"IF($C11=\"\",0,IF($S11>VLOOKUP($C11,PREMISSAS!$C$6:$J$13,4,FALSE),$S11-VLOOKUP($C11,PREMISSAS!$C$6:$J$13,4,FALSE),0))","v":0},5,"QUINTA",0.33333333333333331,5,null,"","","","","","",""]
[null,null,5,{"$f":"IF(D11=\"\",\"\",IF((D11+1)>'PERIODOS E FERIADOS'!$G$6,\"\",D11+1))","v":"2023-05-04"},"Quinta",null,null,null,null,null,null,null,0,null,0,null,null,null,0,null,null,null,{"$f":"IF($C12=\"\",0,IF($S12<=VLOOKUP($C12,PREMISSAS!$C$6:$J$13,4,FALSE),$S12,VLOOKUP($C12,PREMISSAS!$C$6:$J$13,4,FALSE)))","v":0},null,{"$f":"IF($C12=\"\",0,IF($S12>VLOOKUP($C12,PREMISSAS!$C$6:$J$13,4,FALSE),$S12-VLOOKUP($C12,PREMISSAS!$C$6:$J$13,4,FALSE),0))","v":0},6,"SEXTA",0.33333333333333331,6,null,"","","","","","",{"$f":"IF(OR(U12=\"\",U12=0,U12=\"FALTA\",U12=\"SUSPENSO\",U12=\"SUSPENSÃO\"),\"\",TEXT(TEXT(U12,\"##\"\":\"\"##\"),\"[hh]:mm\")*1)","v":""}]
[null,null,6,{"$f":"IF(D12=\"\",\"\",IF((D12+1)>'PERIODOS E FERIADOS'!$G$6,\"\",D12+1))","v":"2023-05-05"},"Sexta",null,null,null,null,null,null,null,0,null,0,null,null,null,0,null,null,null,{"$f":"IF($C13=\"\",0,IF($S13<=VLOOKUP($C13,PREMISSAS!$C$6:$J$13,4,FALSE),$S13,VLOOKUP($C13,PREMISSAS!$C$6:$J$13,4,FALSE)))","v":0},null,{"$f":"IF($C13=\"\",0,IF($S13>VLOOKUP($C13,PREMISSAS!$C$6:$J$13,4,FALSE),$S13-VLOOKUP($C13,PREMISSAS!$C$6:$J$13,4,FALSE),0))","v":0},7,"SÁBADO",0.16666666666666666,7,null,"","","","","","",""]
[null,null,7,{"$f":"IF(D13=\"\",\"\",IF((D13+1)>'PERIODOS E FERIADOS'!$G$6,\"\",D13+1))","v":"2023-05-06"},"Sábado",null,null,null,null,null,null,null,0,null,0,null,null,null,0,null,null,null,{"$f":"IF($C14=\"\",0,IF($S14<=VLOOKUP($C14,PREMISSAS!$C$6:$J$13,4,FALSE),$S14,VLOOKUP($C14,PREMISSAS!$C$6:$J$13,4,FALSE)))","v":0},null,{"$f":"IF($C14=\"\",0,IF($S14>VLOOKUP($C14,PREMISSAS!$C$6:$J$13,4,FALSE),$S14-VLOOKUP($C14,PREMISSAS!$C$6:$J$13,4,FALSE),0))","v":0},1,"DOMINGO",0,1,null,"","","","","","",""]
[null,null,1,{"$f":"IF(D14=\"\",\"\",IF((D14+1)>'PERIODOS E FERIADOS'!$G$6,\"\",D14+1))","v":"2023-05-07"},"Domingo",null,null,null,null,null,null,null,0,null,0,null,null,null,0,null,null,null,{"$f":"IF($C15=\"\",0,IF($S15<=VLOOKUP($C15,PREMISSAS!$C$6:$J$13,4,FALSE),$S15,VLOOKUP($C15,PREMISSAS!$C$6:$J$13,4,FALSE)))","v":0},null,{"$f":"IF($C15=\"\",0,IF($S15>VLOOKUP($C15,PREMISSAS!$C$6:$J$13,4,FALSE),$S15-VLOOKUP($C15,PREMISSAS!$C$6:$J$13,4,FALSE),0))","v":0},"F","FERIADOS",0,"F",null,"","","","","","",""]
[null,null,2,{"$f":"IF(D15=\"\",\"\",IF((D15+1)>'PERIODOS E FERIADOS'!$G$6,\"\",D15+1))","v":"2023-05-08"},"Segunda",null,null,null,null,null,null,null,0,null,0,null,null,null,0,null,null,null,{"$f":"IF($C16=\"\",0,IF($S16<=VLOOKUP($C16,PREMISSAS!$C$6:$J$13,4,FALSE),$S16,VLOOKUP($C16,PREMISSAS!$C$6:$J$13,4,FALSE)))","v":0},null,{"$f":"IF($C16=\"\",0,IF($S16>VLOOKUP($C16,PREMISSAS!$C$6:$J$13,4,FALSE),$S16-VLOOKUP($C16,PREMISSAS!$C$6:$J$13,4,FALSE),0))","v":0},null,"TOTAL SEMANA",{"$f":"SUM(AB8:AB15)","v":1.8333333333333333},null,null,"","","","","","",""]
[null,null,3,{"$f":"IF(D16=\"\",\"\",IF((D16+1)>'PERIODOS E FERIADOS'!$G$6,\"\",D16+1))","v":"2023-05-09"},"Terça",null,null,null,null,null,null,null,0,null,0,null,null,null,0,null,null,null,{"$f":"IF($C17=\"\",0,IF($S17<=VLOOKUP($C17,PREMISSAS!$C$6:$J$13,4,FALSE),$S17,VLOOKUP($C17,PREMISSAS!$C$6:$J$13,4,FALSE)))","v":0},null,{"$f":"IF($C17=\"\",0,IF($S17>VLOOKUP($C17,PREMISSAS!$C$6:$J$13,4,FALSE),$S17-VLOOKUP($C17,PREMISSAS!$C$6:$J$13,4,FALSE),0))","v":0},null,"JORNADA MENSAL",{"$f":"AB16*5","v":9.1666666666666661},null,null,"","","","","","",""]
[null,null,4,{"$f":"IF(D17=\"\",\"\",IF((D17+1)>'PERIODOS E FERIADOS'!$G$6,\"\",D17+1))","v":"2023-05-10"},"Quarta",null,null,null,null,null,null,null,0,null,0,null,null,null,0,null,null,null,{"$f":"IF($C18=\"\",0,IF($S18<=VLOOKUP($C18,PREMISSAS!$C$6:$J$13,4,FALSE),$S18,VLOOKUP($C18,PREMISSAS!$C$6:$J$13,4,FALSE)))","v":0},null,{"$f":"IF($C18=\"\",0,IF($S18>VLOOKUP($C18,PREMISSAS!$C$6:$J$13,4,FALSE),$S18-VLOOKUP($C18,PREMISSAS!$C$6:$J$13,4,FALSE),0))","v":0},null,null,null,null,null,"","","","","","",""]
[null,null,5,{"$f":"IF(D18=\"\",\"\",IF((D18+1)>'PERIODOS E FERIADOS'!$G$6,\"\",D18+1))","v":"2023-05-11"},"Quinta",null,null,null,null,null,null,null,0,null,0,null,null,null,0,null,null,null,{"$f":"IF($C19=\"\",0,IF($S19<=VLOOKUP($C19,PREMISSAS!$C$6:$J$13,4,FALSE),$S19,VLOOKUP($C19,PREMISSAS!$C$6:$J$13,4,FALSE)))","v":0},null,{"$f":"IF($C19=\"\",0,IF($S19>VLOOKUP($C19,PREMISSAS!$C$6:$J$13,4,FALSE),$S19-VLOOKUP($C19,PREMISSAS!$C$6:$J$13,4,FALSE),0))","v":0},null,{"$f":"IF(AB$16>AB$23,\"Jornada Superior a permitida\",IF(AB$16<=AB$23,\"\"))","v":""},null,null,null,"","","","","","",""]
[null,null,6,{"$f":"IF(D19=\"\",\"\",IF((D19+1)>'PERIODOS E FERIADOS'!$G$6,\"\",D19+1))","v":"2023-05-12"},"Sexta",null,null,null,null,null,null,null,0,null,0,null,null,null,0,null,null,null,{"$f":"IF($C20=\"\",0,IF($S20<=VLOOKUP($C20,PREMISSAS!$C$6:$J$13,4,FALSE),$S20,VLOOKUP($C20,PREMISSAS!$C$6:$J$13,4,FALSE)))","v":0},null,{"$f":"IF($C20=\"\",0,IF($S20>VLOOKUP($C20,PREMISSAS!$C$6:$J$13,4,FALSE),$S20-VLOOKUP($C20,PREMISSAS!$C$6:$J$13,4,FALSE),0))","v":0},null,{"$f":"IF(AB$16>AB$23,\"\",IF(AB$16<=AB$23,\"Jornada Ok\"))","v":"Jornada Ok"},null,null,null,"","","","","","",""]
[null,null,7,{"$f":"IF(D20=\"\",\"\",IF((D20+1)>'PERIODOS E FERIADOS'!$G$6,\"\",D20+1))","v":"2023-05-13"},"Sábado",null,null,null,null,null,null,null,0,null,0,null,null,null,0,null,null,null,{"$f":"IF($C21=\"\",0,IF($S21<=VLOOKUP($C21,PREMISSAS!$C$6:$J$13,4,FALSE),$S21,VLOOKUP($C21,PREMISSAS!$C$6:$J$13,4,FALSE)))","v":0},null,{"$f":"IF($C21=\"\",0,IF($S21>VLOOKUP($C21,PREMISSAS!$C$6:$J$13,4,FALSE),$S21-VLOOKUP($C21,PREMISSAS!$C$6:$J$13,4,FALSE),0))","v":0},null,null,null,null,null,"","","","","","",""]
[null,null,1,{"$f":"IF(D21=\"\",\"\",IF((D21+1)>'PERIODOS E FERIADOS'!$G$6,\"\",D21+1))","v":"2023-05-14"},"Domingo",null,null,null,null,null,null,null,0,null,0,null,null,null,0,null,null,null,{"$f":"IF($C22=\"\",0,IF($S22<=VLOOKUP($C22,PREMISSAS!$C$6:$J$13,4,FALSE),$S22,VLOOKUP($C22,PREMISSAS!$C$6:$J$13,4,FALSE)))","v":0},null,{"$f":"IF($C22=\"\",0,IF($S22>VLOOKUP($C22,PREMISSAS!$C$6:$J$13,4,FALSE),$S22-VLOOKUP($C22,PREMISSAS!$C$6:$J$13,4,FALSE),0))","v":0},null,null,null,null,null,"","","","","","",""]
[null,null,2,{"$f":"IF(D22=\"\",\"\",IF((D22+1)>'PERIODOS E FERIADOS'!$G$6,\"\",D22+1))","v":"2023-05-15"},"Segunda",null,null,null,null,null,null,null,0,null,0,null,null,null,0,null,null,null,{"$f":"IF($C23=\"\",0,IF($S23<=VLOOKUP($C23,PREMISSAS!$C$6:$J$13,4,FALSE),$S23,VLOOKUP($C23,PREMISSAS!$C$6:$J$13,4,FALSE)))","v":0},null,{"$f":"IF($C23=\"\",0,IF($S23>VLOOKUP($C23,PREMISSAS!$C$6:$J$13,4,FALSE),$S23-VLOOKUP($C23,PREMISSAS!$C$6:$J$13,4,FALSE),0))","v":0},null,"Jornada Maxima",1.8333333333333333,null,null,"","","","","","",""]
[null,null,3,{"$f":"IF(D23=\"\",\"\",IF((D23+1)>'PERIODOS E FERIADOS'!$G$6,\"\",D23+1))","v":"2023-05-16"},"Terça",null,null,null,null,null,null,null,0,null,0,null,null,null,0,null,null,null,{"$f":"IF($C24=\"\",0,IF($S24<=VLOOKUP($C24,PREMISSAS!$C$6:$J$13,4,FALSE),$S24,VLOOKUP($C24,PREMISSAS!$C$6:$J$13,4,FALSE)))","v":0},null,{"$f":"IF($C24=\"\",0,IF($S24>VLOOKUP($C24,PREMISSAS!$C$6:$J$13,4,FALSE),$S24-VLOOKUP($C24,PREMISSAS!$C$6:$J$13,4,FALSE),0))","v":0},null,null,null,null,null,"","","","","","",""]
[null,null,4,{"$f":"IF(D24=\"\",\"\",IF((D24+1)>'PERIODOS E FERIADOS'!$G$6,\"\",D24+1))","v":"2023-05-17"},"Quarta",null,null,null,null,null,null,null,0,null,0,null,null,null,0,null,null,null,{"$f":"IF($C25=\"\",0,IF($S25<=VLOOKUP($C25,PREMISSAS!$C$6:$J$13,4,FALSE),$S25,VLOOKUP($C25,PREMISSAS!$C$6:$J$13,4,FALSE)))","v":0},null,{"$f":"IF($C25=\"\",0,IF($S25>VLOOKUP($C25,PREMISSAS!$C$6:$J$13,4,FALSE),$S25-VLOOKUP($C25,PREMISSAS!$C$6:$J$13,4,FALSE),0))","v":0},null,null,null,null,null,"","","","","","",""]
[null,null,5,{"$f":"IF(D25=\"\",\"\",IF((D25+1)>'PERIODOS E FERIADOS'!$G$6,\"\",D25+1))","v":"2023-05-18"},"Quinta",null,null,null,null,null,null,null,0,null,0,null,null,null,0,null,null,null,{"$f":"IF($C26=\"\",0,IF($S26<=VLOOKUP($C26,PREMISSAS!$C$6:$J$13,4,FALSE),$S26,VLOOKUP($C26,PREMISSAS!$C$6:$J$13,4,FALSE)))","v":0},null,{"$f":"IF($C26=\"\",0,IF($S26>VLOOKUP($C26,PREMISSAS!$C$6:$J$13,4,FALSE),$S26-VLOOKUP($C26,PREMISSAS!$C$6:$J$13,4,FALSE),0))","v":0},null,null,null,null,null,"","","","","","",""]
[null,null,6,{"$f":"IF(D26=\"\",\"\",IF((D26+1)>'PERIODOS E FERIADOS'!$G$6,\"\",D26+1))","v":"2023-05-19"},"Sexta",null,null,null,null,null,null,null,0,null,0,null,null,null,0,null,null,null,{"$f":"IF($C27=\"\",0,IF($S27<=VLOOKUP($C27,PREMISSAS!$C$6:$J$13,4,FALSE),$S27,VLOOKUP($C27,PREMISSAS!$C$6:$J$13,4,FALSE)))","v":0},null,{"$f":"IF($C27=\"\",0,IF($S27>VLOOKUP($C27,PREMISSAS!$C$6:$J$13,4,FALSE),$S27-VLOOKUP($C27,PREMISSAS!$C$6:$J$13,4,FALSE),0))","v":0},null,null,null,null,null,"","","","","","",""]
[null,null,7,{"$f":"IF(D27=\"\",\"\",IF((D27+1)>'PERIODOS E FERIADOS'!$G$6,\"\",D27+1))","v":"2023-05-20"},"Sábado",null,null,null,null,null,null,null,0,null,0,null,null,null,0,null,null,null,{"$f":"IF($C28=\"\",0,IF($S28<=VLOOKUP($C28,PREMISSAS!$C$6:$J$13,4,FALSE),$S28,VLOOKUP($C28,PREMISSAS!$C$6:$J$13,4,FALSE)))","v":0},null,{"$f":"IF($C28=\"\",0,IF($S28>VLOOKUP($C28,PREMISSAS!$C$6:$J$13,4,FALSE),$S28-VLOOKUP($C28,PREMISSAS!$C$6:$J$13,4,FALSE),0))","v":0},null,null,null,null,null,"","","","","","",""]
[null,null,1,{"$f":"IF(D28=\"\",\"\",IF((D28+1)>'PERIODOS E FERIADOS'!$G$6,\"\",D28+1))","v":"2023-05-21"},"Domingo",null,null,null,null,null,null,null,0,null,0,null,null,null,0,null,null,null,{"$f":"IF($C29=\"\",0,IF($S29<=VLOOKUP($C29,PREMISSAS!$C$6:$J$13,4,FALSE),$S29,VLOOKUP($C29,PREMISSAS!$C$6:$J$13,4,FALSE)))","v":0},null,{"$f":"IF($C29=\"\",0,IF($S29>VLOOKUP($C29,PREMISSAS!$C$6:$J$13,4,FALSE),$S29-VLOOKUP($C29,PREMISSAS!$C$6:$J$13,4,FALSE),0))","v":0},null,null,null,null,null,"","","","","","",""]
[null,null,2,{"$f":"IF(D29=\"\",\"\",IF((D29+1)>'PERIODOS E FERIADOS'!$G$6,\"\",D29+1))","v":"2023-05-22"},"Segunda",null,null,null,null,null,null,null,0,null,0,null,null,null,0,null,null,null,{"$f":"IF($C30=\"\",0,IF($S30<=VLOOKUP($C30,PREMISSAS!$C$6:$J$13,4,FALSE),$S30,VLOOKUP($C30,PREMISSAS!$C$6:$J$13,4,FALSE)))","v":0},null,{"$f":"IF($C30=\"\",0,IF($S30>VLOOKUP($C30,PREMISSAS!$C$6:$J$13,4,FALSE),$S30-VLOOKUP($C30,PREMISSAS!$C$6:$J$13,4,FALSE),0))","v":0},null,null,null,null,null,"","","","","","",""]
[null,null,3,{"$f":"IF(D30=\"\",\"\",IF((D30+1)>'PERIODOS E FERIADOS'!$G$6,\"\",D30+1))","v":"2023-05-23"},"Terça",null,null,null,null,null,null,null,0,null,0,null,null,null,0,null,null,null,{"$f":"IF($C31=\"\",0,IF($S31<=VLOOKUP($C31,PREMISSAS!$C$6:$J$13,4,FALSE),$S31,VLOOKUP($C31,PREMISSAS!$C$6:$J$13,4,FALSE)))","v":0},null,{"$f":"IF($C31=\"\",0,IF($S31>VLOOKUP($C31,PREMISSAS!$C$6:$J$13,4,FALSE),$S31-VLOOKUP($C31,PREMISSAS!$C$6:$J$13,4,FALSE),0))","v":0},null,null,null,null,null,"","","","","","",""]
[null,null,4,{"$f":"IF(D31=\"\",\"\",IF((D31+1)>'PERIODOS E FERIADOS'!$G$6,\"\",D31+1))","v":"2023-05-24"},"Quarta",null,null,null,null,null,null,null,0,null,0,null,null,null,0,null,null,null,{"$f":"IF($C32=\"\",0,IF($S32<=VLOOKUP($C32,PREMISSAS!$C$6:$J$13,4,FALSE),$S32,VLOOKUP($C32,PREMISSAS!$C$6:$J$13,4,FALSE)))","v":0},null,{"$f":"IF($C32=\"\",0,IF($S32>VLOOKUP($C32,PREMISSAS!$C$6:$J$13,4,FALSE),$S32-VLOOKUP($C32,PREMISSAS!$C$6:$J$13,4,FALSE),0))","v":0},null,null,null,null,null,{"$f":"IF(OR(F32=\"\",F32=0,F32=\"FALTA\",F32=\"SUSPENSO\",F32=\"SUSPENSÃO\"),\"\",TEXT(F32,\"##\"\":\"\"##\"))","v":""},{"$f":"IF(OR(G32=\"\",G32=0,G32=\"FALTA\",G32=\"SUSPENSO\",G32=\"SUSPENSÃO\"),\"\",TEXT(G32,\"##\"\":\"\"##\"))","v":""},"","",{"$f":"IF(OR(J32=\"\",J32=0,J32=\"FALTA\",J32=\"SUSPENSO\",J32=\"SUSPENSÃO\"),\"\",TEXT(J32,\"##\"\":\"\"##\"))","v":""},{"$f":"IF(OR(K32=\"\",K32=0,K32=\"FALTA\",K32=\"SUSPENSO\",K32=\"SUSPENSÃO\"),\"\",TEXT(K32,\"##\"\":\"\"##\"))","v":""},""]
[null,null,5,{"$f":"IF(D32=\"\",\"\",IF((D32+1)>'PERIODOS E FERIADOS'!$G$6,\"\",D32+1))","v":"2023-05-25"},"Quinta",null,null,null,null,null,null,null,0,null,0,null,null,null,0,null,null,null,{"$f":"IF($C33=\"\",0,IF($S33<=VLOOKUP($C33,PREMISSAS!$C$6:$J$13,4,FALSE),$S33,VLOOKUP($C33,PREMISSAS!$C$6:$J$13,4,FALSE)))","v":0},null,{"$f":"IF($C33=\"\",0,IF($S33>VLOOKUP($C33,PREMISSAS!$C$6:$J$13,4,FALSE),$S33-VLOOKUP($C33,PREMISSAS!$C$6:$J$13,4,FALSE),0))","v":0},null,null,null,null,null,{"$f":"IF(OR(F33=\"\",F33=0,F33=\"FALTA\",F33=\"SUSPENSO\",F33=\"SUSPENSÃO\"),\"\",TEXT(F33,\"##\"\":\"\"##\"))","v":""},"","","","","",""]
[null,null,6,{"$f":"IF(D33=\"\",\"\",IF((D33+1)>'PERIODOS E FERIADOS'!$G$6,\"\",D33+1))","v":"2023-05-26"},"Sexta",null,null,null,null,null,null,null,0,null,0,null,null,null,0,null,null,null,{"$f":"IF($C34=\"\",0,IF($S34<=VLOOKUP($C34,PREMISSAS!$C$6:$J$13,4,FALSE),$S34,VLOOKUP($C34,PREMISSAS!$C$6:$J$13,4,FALSE)))","v":0},null,{"$f":"IF($C34=\"\",0,IF($S34>VLOOKUP($C34,PREMISSAS!$C$6:$J$13,4,FALSE),$S34-VLOOKUP($C34,PREMISSAS!$C$6:$J$13,4,FALSE),0))","v":0},null,null,null,null,null,"","","","","","",""]
[null,null,7,{"$f":"IF(D34=\"\",\"\",IF((D34+1)>'PERIODOS E FERIADOS'!$G$6,\"\",D34+1))","v":"2023-05-27"},"Sábado",null,null,null,null,null,null,null,0,null,0,null,null,null,0,null,null,null,{"$f":"IF($C35=\"\",0,IF($S35<=VLOOKUP($C35,PREMISSAS!$C$6:$J$13,4,FALSE),$S35,VLOOKUP($C35,PREMISSAS!$C$6:$J$13,4,FALSE)))","v":0},null,{"$f":"IF($C35=\"\",0,IF($S35>VLOOKUP($C35,PREMISSAS!$C$6:$J$13,4,FALSE),$S35-VLOOKUP($C35,PREMISSAS!$C$6:$J$13,4,FALSE),0))","v":0},null,null,null,null,null,"","","","","","",""]
[null,null,1,{"$f":"IF(D35=\"\",\"\",IF((D35+1)>'PERIODOS E FERIADOS'!$G$6,\"\",D35+1))","v":"2023-05-28"},"Domingo",null,null,null,null,null,null,null,0,null,0,null,null,null,0,null,null,null,{"$f":"IF($C36=\"\",0,IF($S36<=VLOOKUP($C36,PREMISSAS!$C$6:$J$13,4,FALSE),$S36,VLOOKUP($C36,PREMISSAS!$C$6:$J$13,4,FALSE)))","v":0},null,{"$f":"IF($C36=\"\",0,IF($S36>VLOOKUP($C36,PREMISSAS!$C$6:$J$13,4,FALSE),$S36-VLOOKUP($C36,PREMISSAS!$C$6:$J$13,4,FALSE),0))","v":0},null,null,null,null,null,"","","","","","",""]
[null,null,2,{"$f":"IF(D36=\"\",\"\",IF((D36+1)>'PERIODOS E FERIADOS'!$G$6,\"\",D36+1))","v":"2023-05-29"},"Segunda",null,null,null,null,null,null,null,0,null,0,null,null,null,0,null,null,null,{"$f":"IF($C37=\"\",0,IF($S37<=VLOOKUP($C37,PREMISSAS!$C$6:$J$13,4,FALSE),$S37,VLOOKUP($C37,PREMISSAS!$C$6:$J$13,4,FALSE)))","v":0},null,{"$f":"IF($C37=\"\",0,IF($S37>VLOOKUP($C37,PREMISSAS!$C$6:$J$13,4,FALSE),$S37-VLOOKUP($C37,PREMISSAS!$C$6:$J$13,4,FALSE),0))","v":0},null,null,null,null,null,"","","","","","",""]
[null,null,3,{"$f":"IF(D37=\"\",\"\",IF((D37+1)>'PERIODOS E FERIADOS'!$G$6,\"\",D37+1))","v":"2023-05-30"},"Terça",null,null,null,null,null,null,null,0,null,0,null,null,null,0,null,null,null,{"$f":"IF($C38=\"\",0,IF($S38<=VLOOKUP($C38,PREMISSAS!$C$6:$J$13,4,FALSE),$S38,VLOOKUP($C38,PREMISSAS!$C$6:$J$13,4,FALSE)))","v":0},null,{"$f":"IF($C38=\"\",0,IF($S38>VLOOKUP($C38,PREMISSAS!$C$6:$J$13,4,FALSE),$S38-VLOOKUP($C38,PREMISSAS!$C$6:$J$13,4,FALSE),0))","v":0},null,null,null,null,null,"","","","","","",""]
[null,null,4,{"$f":"IF(D38=\"\",\"\",IF((D38+1)>'PERIODOS E FERIADOS'!$G$6,\"\",D38+1))","v":"2023-05-31"},"Quarta",null,null,null,null,null,null,null,0,null,0,null,null,null,0,null,null,null,{"$f":"IF($C39=\"\",0,IF($S39<=VLOOKUP($C39,PREMISSAS!$C$6:$J$13,4,FALSE),$S39,VLOOKUP($C39,PREMISSAS!$C$6:$J$13,4,FALSE)))","v":0},null,{"$f":"IF($C39=\"\",0,IF($S39>VLOOKUP($C39,PREMISSAS!$C$6:$J$13,4,FALSE),$S39-VLOOKUP($C39,PREMISSAS!$C$6:$J$13,4,FALSE),0))","v":0},null,null,null,null,null,"","","","","","",""]
[]
[null,null,null,"TOTAIS",null,null,"Faltas / Suspensão",null,{"$f":"COUNTIF($F$9:$F$39,\"FALTA\")+COUNTIF($F$9:$F$39,\"SUSPENSÃO\")+COUNTIF($F$9:$F$39,\"SUSPENSO\")+COUNTIF($F$9:$F$39,\"SUSPENSAO\")","v":0},null,null,null,{"$f":"SUM($M$9:$M$39)","v":0},null,{"$f":"SUM($O$9:$O$39)","v":0},null,null,null,{"$f":"SUM(S$9:S$39)","v":0},null,{"$f":"$AK$41","v":0},null,{"$f":"SUM(W$9:W$39)","v":0},null,{"$f":"SUM(Y$9:Y$39)","v":0},null,null,null,null,null,null,null,null,null,null,null,{"$f":"SUM(AK9:AK39)","v":0}]
[]
[null,null,null,"OBSERVAÇÕES:"]

{"sheet":"FUNC 7","index":11,"n_rows":43,"n_cols":37,"rows_kept":43,"cut":false,"hidden":false,"merged":[[5,30,5,33],[40,3,40,5],[40,6,40,7],[40,8,40,10],[42,3,43,24],[18,26,18,27],[19,26,19,27],[3,3,4,27],[5,3,5,4],[5,5,5,10],[5,12,5,20],[5,22,5,24],[5,26,5,27]]}
[]
[]
[]
[null,null,null,{"$f":"'PERIODOS E FERIADOS'!$E$5","v":0}]
[]
[null,null,null,"Funcionário",null,{"$f":"FUNCIONÁRIOS!E11","v":7},null,null,null,null,null,null,"H.E. / Atrasos / A.N",null,null,null,null,null,null,null,null,null,"Distrib. H.E. p/ Faixa",null,null,null,"CARGA HORÁRIA",null,null,null,"ESPELHO"]
[]
[null,null,null,"Data","Dia Semana","Entrada","Saída","Entrada","Saída","Entrada","Saída",null,"H. Diária",null,"Atrasos",null,"Abona",null,"Horas Extras",null,"Adc. Noturno",null,{"$f":"PREMISSAS!H6","v":0.5},null,{"$f":"PREMISSAS!H12","v":1},2,"SEGUNDA",0.33333333333333331,2,null,"Entrada","Saída","Entrada","Saída","Entrada","Saída","AN "]
[null,null,{"$f":"IF(NOT(ISERROR(VLOOKUP(D9,rngFeriados,1,FALSE))),\"F\",IF(D9=\"\",\"\",WEEKDAY($D9,1)))","v":"F"},{"$f":"'PERIODOS E FERIADOS'!$E$6","v":"2023-05-01"},{"$f":"IF(D9=\"\",\"\",IF(WEEKDAY(D9,1)=1,\"Domingo\",IF(WEEKDAY(D9,1)=2,\"Segunda\",IF(WEEKDAY(D9,1)=3,\"Terça\",IF(WEEKDAY(D9,1)=4,\"Quarta\",IF(WEEKDAY(D9,1)=5,\"Quinta\",IF(WEEKDAY(D9,1)=6,\"Sexta\",IF(WEEKDAY(D9,1)=7,\"Sábado\"))))))))","v":"Segunda"},null,null,null,null,null,null,null,{"$f":"IF(ISERROR(IF(OR($AF9=\"\",$AF9=0),0,(IF(TEXT($AF9,\"[hh]:mm:ss\")<TEXT($AE9,\"[hh]:mm:ss\"),(1-$AE9+$AF9),$AF9-$AE9))+IF(OR($AH9=\"\",$AH9=0),0,(IF(TEXT($AH9,\"[hh]:mm:ss\")<TEXT($AG9,\"[hh]:mm:ss\"),(1-$AG9+$AH9),$AH9-$AG9))+IF(OR($AJ9=\"\",$AJ9=0),0,(IF(TEXT($AJ9,\"[hh]:mm:ss\")<TEXT($AI9,\"[hh]:mm:ss\"),(1-$AI9+$AJ9),$AJ9-$AI9)))))),0,IF(OR($AF9=\"\",$AF9=0),0,(IF(TEXT($AF9,\"[hh]:mm:ss\")<TEXT($AE9,\"[hh]:mm:ss\"),(1-$AE9+$AF9),$AF9-$AE9))+IF(OR($AH9=\"\",$AH9=0),0,(IF(TEXT($AH9,\"[hh]:mm:ss\")<TEXT($AG9,\"[hh]:mm:ss\"),(1-$AG9+$AH9),$AH9-$AG9))+IF(OR($AJ9=\"\",$AJ9=0),0,(IF(TEXT($AJ9,\"[hh]:mm:ss\")<TEXT($AI9,\"[hh]:mm:ss\"),(1-$AI9+$AJ9),$AJ9-$AI9))))))","v":0},null,{"$f":"IF($C9=\"\",0,IF(Q9=\"Sim\",0,IF(TEXT(IF(OR((VLOOKUP($C9,$Z$8:$AB$15,3,FALSE)-$M9)<0,$AE9=\"\"),0,(VLOOKUP($C9,$Z$8:$AB$15,3,FALSE)-$M9)),\"[hh]:mm\")<=TEXT(rngTolerancia,\"[hh]:mm\"),0,IF(OR((VLOOKUP($C9,$Z$8:$AB$15,3,FALSE)-$M9)<0,$AE9=\"\"),0,(VLOOKUP($C9,$Z$8:$AB$15,3,FALSE)-$M9)))))","v":0},null,null,null,{"$f":"IF($C9=\"\",0,IF(TEXT(IF(($M9-VLOOKUP($C9,$Z$8:$AB$15,3,FALSE))<0,0,($M9-VLOOKUP($C9,$Z$8:$AB$15,3,FALSE))),\"[hh]:mm\")<=TEXT(rngTolerancia,\"[hh]:mm\"),0,IF(($M9-VLOOKUP($C9,$Z$8:$AB$15,3,FALSE))<0,0,($M9-VLOOKUP($C9,$Z$8:$AB$15,3,FALSE)))))","v":0},null,null,null,{"$f":"IF($C9=\"\",0,IF($S9<=VLOOKUP($C9,PREMISSAS!$C$6:$J$13,4,FALSE),$S9,VLOOKUP($C9,PREMISSAS!$C$6:$J$13,4,FALSE)))","v":0},null,{"$f":"IF($C9=\"\",0,IF($S9>VLOOKUP($C9,PREMISSAS!$C$6:$J$13,4,FALSE),$S9-VLOOKUP($C9,PREMISSAS!$C$6:$J$13,4,FALSE),0))","v":0},3,"TERÇA",0.33333333333333331,3,null,{"$f":"IF(OR(F9=\"\",F9=0,F9=\"FALTA\",F9=\"SUSPENSO\",F9=\"SUSPENSÃO\"),\"\",TEXT(F9,\"##\"\":\"\"##\"))","v":""},{"$f":"IF(OR(G9=\"\",G9=0,G9=\"FALTA\",G9=\"SUSPENSO\",G9=\"SUSPENSÃO\"),\"\",TEXT(G9,\"##\"\":\"\"##\"))","v":""},"","",{"$f":"IF(OR(J9=\"\",J9=0,J9=\"FALTA\",J9=\"SUSPENSO\",J9=\"SUSPENSÃO\"),\"\",TEXT(J9,\"##\"\":\"\"##\"))","v":""},{"$f":"IF(OR(K9=\"\",K9=0,K9=\"FALTA\",K9=\"SUSPENSO\",K9=\"SUSPENSÃO\"),\"\",TEXT(K9,\"##\"\":\"\"##\"))","v":""},{"$f":"IF(OR(U9=\"\",U9=0,U9=\"FALTA\",U9=\"SUSPENSO\",U9=\"SUSPENSÃO\"),\"\",TEXT(TEXT(U9,\"00\"\":\"\"00\"),\"[hh]:mm\")*1)","v":""}]
[null,null,3,{"$f":"IF(D9=\"\",\"\",IF((D9+1)>'PERIODOS E FERIADOS'!$G$6,\"\",D9+1))","v":"2023-05-02"},{"$f":"IF(D10=\"\",\"\",IF(WEEKDAY(D10,1)=1,\"Domingo\",IF(WEEKDAY(D10,1)=2,\"Segunda\",IF(WEEKDAY(D10,1)=3,\"Terça\",IF(WEEKDAY(D10,1)=4,\"Quarta\",IF(WEEKDAY(D10,1)=5,\"Quinta\",IF(WEEKDAY(D10,1)=6,\"Sexta\",IF(WEEKDAY(D10,1)=7,\"Sábado\"))))))))","v":"Terça"},null,null,null,null,null,null,null,{"$f":"IF(ISERROR(IF(OR($AF10=\"\",$AF10=0),0,(IF(TEXT($AF10,\"[hh]:mm:ss\")<TEXT($AE10,\"[hh]:mm:ss\"),(1-$AE10+$AF10),$AF10-$AE10))+IF(OR($AH10=\"\",$AH10=0),0,(IF(TEXT($AH10,\"[hh]:mm:ss\")<TEXT($AG10,\"[hh]:mm:ss\"),(1-$AG10+$AH10),$AH10-$AG10))+IF(OR($AJ10=\"\",$AJ10=0),0,(IF(TEXT($AJ10,\"[hh]:mm:ss\")<TEXT($AI10,\"[hh]:mm:ss\"),(1-$AI10+$AJ10),$AJ10-$AI10)))))),0,IF(OR($AF10=\"\",$AF10=0),0,(IF(TEXT($AF10,\"[hh]:mm:ss\")<TEXT($AE10,\"[hh]:mm:ss\"),(1-$AE10+$AF10),$AF10-$AE10))+IF(OR($AH10=\"\",$AH10=0),0,(IF(TEXT($AH10,\"[hh]:mm:ss\")<TEXT($AG10,\"[hh]:mm:ss\"),(1-$AG10+$AH10),$AH10-$AG10))+IF(OR($AJ10=\"\",$AJ10=0),0,(IF(TEXT($AJ10,\"[hh]:mm:ss\")<TEXT($AI10,\"[hh]:mm:ss\"),(1-$AI10+$AJ10),$AJ10-$AI10))))))","v":0},null,{"$f":"IF($C10=\"\",0,IF(Q10=\"Sim\",0,IF(TEXT(IF(OR((VLOOKUP($C10,$Z$8:$AB$15,3,FALSE)-$M10)<0,$AE10=\"\"),0,(VLOOKUP($C10,$Z$8:$AB$15,3,FALSE)-$M10)),\"[hh]:mm\")<=TEXT(rngTolerancia,\"[hh]:mm\"),0,IF(OR((VLOOKUP($C10,$Z$8:$AB$15,3,FALSE)-$M10)<0,$AE10=\"\"),0,(VLOOKUP($C10,$Z$8:$AB$15,3,FALSE)-$M10)))))","v":0},null,null,null,0,null,null,null,{"$f":"IF($C10=\"\",0,IF($S10<=VLOOKUP($C10,PREMISSAS!$C$6:$J$13,4,FALSE),$S10,VLOOKUP($C10,PREMISSAS!$C$6:$J$13,4,FALSE)))","v":0},null,{"$f":"IF($C10=\"\",0,IF($S10>VLOOKUP($C10,PREMISSAS!$C$6:$J$13,4,FALSE),$S10-VLOOKUP($C10,PREMISSAS!$C$6:$J$13,4,FALSE),0))","v":0},4,"QUARTA",0.33333333333333331,4,null,{"$f":"IF(OR(F10=\"\",F10=0,F10=\"FALTA\",F10=\"SUSPENSO\",F10=\"SUSPENSÃO\"),\"\",TEXT(F10,\"##\"\":\"\"##\"))","v":""},"","","","","",{"$f":"IF(OR(U10=\"\",U10=0,U10=\"FALTA\",U10=\"SUSPENSO\",U10=\"SUSPENSÃO\"),\"\",TEXT(TEXT(U10,\"00\"\":\"\"00\"),\"[hh]:mm\")*1)","v":""}]
[null,null,4,{"$f":"IF(D10=\"\",\"\",IF((D10+1)>'PERIODOS E FERIADOS'!$G$6,\"\",D10+1))","v":"2023-05-03"},"Quarta",null,null,null,null,null,null,null,0,null,0,null,null,null,0,null,null,null,{"$f":"IF($C11=\"\",0,IF($S11<=VLOOKUP($C11,PREMISSAS!$C$6:$J$13,4,FALSE),$S11,VLOOKUP($C11,PREMISSAS!$C$6:$J$13,4,FALSE)))","v":0},null,{"$f":"IF($C11=\"\",0,IF($S11>VLOOKUP($C11,PREMISSAS!$C$6:$J$13,4,FALSE),$S11-VLOOKUP($C11,PREMISSAS!$C$6:$J$13,4,FALSE),0))","v":0},5,"QUINTA",0.33333333333333331,5,null,"","","","","","",""]
[null,null,5,{"$f":"IF(D11=\"\",\"\",IF((D11+1)>'PERIODOS E FERIADOS'!$G$6,\"\",D11+1))","v":"2023-05-04"},"Quinta",null,null,null,null,null,null,null,0,null,0,null,null,null,0,null,null,null,{"$f":"IF($C12=\"\",0,IF($S12<=VLOOKUP($C12,PREMISSAS!$C$6:$J$13,4,FALSE),$S12,VLOOKUP($C12,PREMISSAS!$C$6:$J$13,4,FALSE)))","v":0},null,{"$f":"IF($C12=\"\",0,IF($S12>VLOOKUP($C12,PREMISSAS!$C$6:$J$13,4,FALSE),$S12-VLOOKUP($C12,PREMISSAS!$C$6:$J$13,4,FALSE),0))","v":0},6,"SEXTA",0.33333333333333331,6,null,"","","","","","",{"$f":"IF(OR(U12=\"\",U12=0,U12=\"FALTA\",U12=\"SUSPENSO\",U12=\"SUSPENSÃO\"),\"\",TEXT(TEXT(U12,\"##\"\":\"\"##\"),\"[hh]:mm\")*1)","v":""}]
[null,null,6,{"$f":"IF(D12=\"\",\"\",IF((D12+1)>'PERIODOS E FERIADOS'!$G$6,\"\",D12+1))","v":"2023-05-05"},"Sexta",null,null,null,null,null,null,null,0,null,0,null,null,null,0,null,null,null,{"$f":"IF($C13=\"\",0,IF($S13<=VLOOKUP($C13,PREMISSAS!$C$6:$J$13,4,FALSE),$S13,VLOOKUP($C13,PREMISSAS!$C$6:$J$13,4,FALSE)))","v":0},null,{"$f":"IF($C13=\"\",0,IF($S13>VLOOKUP($C13,PREMISSAS!$C$6:$J$13,4,FALSE),$S13-VLOOKUP($C13,PREMISSAS!$C$6:$J$13,4,FALSE),0))","v":0},7,"SÁBADO",0.16666666666666666,7,null,"","","","","","",""]
[null,null,7,{"$f":"IF(D13=\"\",\"\",IF((D13+1)>'PERIODOS E FERIADOS'!$G$6,\"\",D13+1))","v":"2023-05-06"},"Sábado",null,null,null,null,null,null,null,0,null,0,null,null,null,0,null,null,null,{"$f":"IF($C14=\"\",0,IF($S14<=VLOOKUP($C14,PREMISSAS!$C$6:$J$13,4,FALSE),$S14,VLOOKUP($C14,PREMISSAS!$C$6:$J$13,4,FALSE)))","v":0},null,{"$f":"IF($C14=\"\",0,IF($S14>VLOOKUP($C14,PREMISSAS!$C$6:$J$13,4,FALSE),$S14-VLOOKUP($C14,PREMISSAS!$C$6:$J$13,4,FALSE),0))","v":0},1,"DOMINGO",0,1,null,"","","","","","",""]
[null,null,1,{"$f":"IF(D14=\"\",\"\",IF((D14+1)>'PERIODOS E FERIADOS'!$G$6,\"\",D14+1))","v":"2023-05-07"},"Domingo",null,null,null,null,null,null,null,0,null,0,null,null,null,0,null,null,null,{"$f":"IF($C15=\"\",0,IF($S15<=VLOOKUP($C15,PREMISSAS!$C$6:$J$13,4,FALSE),$S15,VLOOKUP($C15,PREMISSAS!$C$6:$J$13,4,FALSE)))","v":0},null,{"$f":"IF($C15=\"\",0,IF($S15>VLOOKUP($C15,PREMISSAS!$C$6:$J$13,4,FALSE),$S15-VLOOKUP($C15,PREMISSAS!$C$6:$J$13,4,FALSE),0))","v":0},"F","FERIADOS",0,"F",null,"","","","","","",""]
[null,null,2,{"$f":"IF(D15=\"\",\"\",IF((D15+1)>'PERIODOS E FERIADOS'!$G$6,\"\",D15+1))","v":"2023-05-08"},"Segunda",null,null,null,null,null,null,null,0,null,0,null,null,null,0,null,null,null,{"$f":"IF($C16=\"\",0,IF($S16<=VLOOKUP($C16,PREMISSAS!$C$6:$J$13,4,FALSE),$S16,VLOOKUP($C16,PREMISSAS!$C$6:$J$13,4,FALSE)))","v":0},null,{"$f":"IF($C16=\"\",0,IF($S16>VLOOKUP($C16,PREMISSAS!$C$6:$J$13,4,FALSE),$S16-VLOOKUP($C16,PREMISSAS!$C$6:$J$13,4,FALSE),0))","v":0},null,"TOTAL SEMANA",{"$f":"SUM(AB8:AB15)","v":1.8333333333333333},null,null,"","","","","","",""]
[null,null,3,{"$f":"IF(D16=\"\",\"\",IF((D16+1)>'PERIODOS E FERIADOS'!$G$6,\"\",D16+1))","v":"2023-05-09"},"Terça",null,null,null,null,null,null,null,0,null,0,null,null,null,0,null,null,null,{"$f":"IF($C17=\"\",0,IF($S17<=VLOOKUP($C17,PREMISSAS!$C$6:$J$13,4,FALSE),$S17,VLOOKUP($C17,PREMISSAS!$C$6:$J$13,4,FALSE)))","v":0},null,{"$f":"IF($C17=\"\",0,IF($S17>VLOOKUP($C17,PREMISSAS!$C$6:$J$13,4,FALSE),$S17-VLOOKUP($C17,PREMISSAS!$C$6:$J$13,4,FALSE),0))","v":0},null,"JORNADA MENSAL",{"$f":"AB16*5","v":9.1666666666666661},null,null,"","","","","","",""]
[null,null,4,{"$f":"IF(D17=\"\",\"\",IF((D17+1)>'PERIODOS E FERIADOS'!$G$6,\"\",D17+1))","v":"2023-05-10"},"Quarta",null,null,null,null,null,null,null,0,null,0,null,null,null,0,null,null,null,{"$f":"IF($C18=\"\",0,IF($S18<=VLOOKUP($C18,PREMISSAS!$C$6:$J$13,4,FALSE),$S18,VLOOKUP($C18,PREMISSAS!$C$6:$J$13,4,FALSE)))","v":0},null,{"$f":"IF($C18=\"\",0,IF($S18>VLOOKUP($C18,PREMISSAS!$C$6:$J$13,4,FALSE),$S18-VLOOKUP($C18,PREMISSAS!$C$6:$J$13,4,FALSE),0))","v":0},null,null,null,null,null,"","","","","","",""]
[null,null,5,{"$f":"IF(D18=\"\",\"\",IF((D18+1)>'PERIODOS E FERIADOS'!$G$6,\"\",D18+1))","v":"2023-05-11"},"Quinta",null,null,null,null,null,null,null,0,null,0,null,null,null,0,null,null,null,{"$f":"IF($C19=\"\",0,IF($S19<=VLOOKUP($C19,PREMISSAS!$C$6:$J$13,4,FALSE),$S19,VLOOKUP($C19,PREMISSAS!$C$6:$J$13,4,FALSE)))","v":0},null,{"$f":"IF($C19=\"\",0,IF($S19>VLOOKUP($C19,PREMISSAS!$C$6:$J$13,4,FALSE),$S19-VLOOKUP($C19,PREMISSAS!$C$6:$J$13,4,FALSE),0))","v":0},null,{"$f":"IF(AB$16>AB$23,\"Jornada Superior a permitida\",IF(AB$16<=AB$23,\"\"))","v":""},null,null,null,"","","","","","",""]
[null,null,6,{"$f":"IF(D19=\"\",\"\",IF((D19+1)>'PERIODOS E FERIADOS'!$G$6,\"\",D19+1))","v":"2023-05-12"},"Sexta",null,null,null,null,null,null,null,0,null,0,null,null,null,0,null,null,null,{"$f":"IF($C20=\"\",0,IF($S20<=VLOOKUP($C20,PREMISSAS!$C$6:$J$13,4,FALSE),$S20,VLOOKUP($C20,PREMISSAS!$C$6:$J$13,4,FALSE)))","v":0},null,{"$f":"IF($C20=\"\",0,IF($S20>VLOOKUP($C20,PREMISSAS!$C$6:$J$13,4,FALSE),$S20-VLOOKUP($C20,PREMISSAS!$C$6:$J$13,4,FALSE),0))","v":0},null,{"$f":"IF(AB$16>AB$23,\"\",IF(AB$16<=AB$23,\"Jornada Ok\"))","v":"Jornada Ok"},null,null,null,"","","","","","",""]
[null,null,7,{"$f":"IF(D20=\"\",\"\",IF((D20+1)>'PERIODOS E FERIADOS'!$G$6,\"\",D20+1))","v":"2023-05-13"},"Sábado",null,null,null,null,null,null,null,0,null,0,null,null,null,0,null,null,null,{"$f":"IF($C21=\"\",0,IF($S21<=VLOOKUP($C21,PREMISSAS!$C$6:$J$13,4,FALSE),$S21,VLOOKUP($C21,PREMISSAS!$C$6:$J$13,4,FALSE)))","v":0},null,{"$f":"IF($C21=\"\",0,IF($S21>VLOOKUP($C21,PREMISSAS!$C$6:$J$13,4,FALSE),$S21-VLOOKUP($C21,PREMISSAS!$C$6:$J$13,4,FALSE),0))","v":0},null,null,null,null,null,"","","","","","",""]
[null,null,1,{"$f":"IF(D21=\"\",\"\",IF((D21+1)>'PERIODOS E FERIADOS'!$G$6,\"\",D21+1))","v":"2023-05-14"},"Domingo",null,null,null,null,null,null,null,0,null,0,null,null,null,0,null,null,null,{"$f":"IF($C22=\"\",0,IF($S22<=VLOOKUP($C22,PREMISSAS!$C$6:$J$13,4,FALSE),$S22,VLOOKUP($C22,PREMISSAS!$C$6:$J$13,4,FALSE)))","v":0},null,{"$f":"IF($C22=\"\",0,IF($S22>VLOOKUP($C22,PREMISSAS!$C$6:$J$13,4,FALSE),$S22-VLOOKUP($C22,PREMISSAS!$C$6:$J$13,4,FALSE),0))","v":0},null,null,null,null,null,"","","","","","",""]
[null,null,2,{"$f":"IF(D22=\"\",\"\",IF((D22+1)>'PERIODOS E FERIADOS'!$G$6,\"\",D22+1))","v":"2023-05-15"},"Segunda",null,null,null,null,null,null,null,0,null,0,null,null,null,0,null,null,null,{"$f":"IF($C23=\"\",0,IF($S23<=VLOOKUP($C23,PREMISSAS!$C$6:$J$13,4,FALSE),$S23,VLOOKUP($C23,PREMISSAS!$C$6:$J$13,4,FALSE)))","v":0},null,{"$f":"IF($C23=\"\",0,IF($S23>VLOOKUP($C23,PREMISSAS!$C$6:$J$13,4,FALSE),$S23-VLOOKUP($C23,PREMISSAS!$C$6:$J$13,4,FALSE),0))","v":0},null,"Jornada Maxima",1.8333333333333333,null,null,"","","","","","",""]
[null,null,3,{"$f":"IF(D23=\"\",\"\",IF((D23+1)>'PERIODOS E FERIADOS'!$G$6,\"\",D23+1))","v":"2023-05-16"},"Terça",null,null,null,null,null,null,null,0,null,0,null,null,null,0,null,null,null,{"$f":"IF($C24=\"\",0,IF($S24<=VLOOKUP($C24,PREMISSAS!$C$6:$J$13,4,FALSE),$S24,VLOOKUP($C24,PREMISSAS!$C$6:$J$13,4,FALSE)))","v":0},null,{"$f":"IF($C24=\"\",0,IF($S24>VLOOKUP($C24,PREMISSAS!$C$6:$J$13,4,FALSE),$S24-VLOOKUP($C24,PREMISSAS!$C$6:$J$13,4,FALSE),0))","v":0},null,null,null,null,null,"","","","","","",""]
[null,null,4,{"$f":"IF(D24=\"\",\"\",IF((D24+1)>'PERIODOS E FERIADOS'!$G$6,\"\",D24+1))","v":"2023-05-17"},"Quarta",null,null,null,null,null,null,null,0,null,0,null,null,null,0,null,null,null,{"$f":"IF($C25=\"\",0,IF($S25<=VLOOKUP($C25,PREMISSAS!$C$6:$J$13,4,FALSE),$S25,VLOOKUP($C25,PREMISSAS!$C$6:$J$13,4,FALSE)))","v":0},null,{"$f":"IF($C25=\"\",0,IF($S25>VLOOKUP($C25,PREMISSAS!$C$6:$J$13,4,FALSE),$S25-VLOOKUP($C25,PREMISSAS!$C$6:$J$13,4,FALSE),0))","v":0},null,null,null,null,null,"","","","","","",""]
[null,null,5,{"$f":"IF(D25=\"\",\"\",IF((D25+1)>'PERIODOS E FERIADOS'!$G$6,\"\",D25+1))","v":"2023-05-18"},"Quinta",null,null,null,null,null,null,null,0,null,0,null,null,null,0,null,null,null,{"$f":"IF($C26=\"\",0,IF($S26<=VLOOKUP($C26,PREMISSAS!$C$6:$J$13,4,FALSE),$S26,VLOOKUP($C26,PREMISSAS!$C$6:$J$13,4,FALSE)))","v":0},null,{"$f":"IF($C26=\"\",0,IF($S26>VLOOKUP($C26,PREMISSAS!$C$6:$J$13,4,FALSE),$S26-VLOOKUP($C26,PREMISSAS!$C$6:$J$13,4,FALSE),0))","v":0},null,null,null,null,null,"","","","","","",""]
[null,null,6,{"$f":"IF(D26=\"\",\"\",IF((D26+1)>'PERIODOS E FERIADOS'!$G$6,\"\",D26+1))","v":"2023-05-19"},"Sexta",null,null,null,null,null,null,null,0,null,0,null,null,null,0,null,null,null,{"$f":"IF($C27=\"\",0,IF($S27<=VLOOKUP($C27,PREMISSAS!$C$6:$J$13,4,FALSE),$S27,VLOOKUP($C27,PREMISSAS!$C$6:$J$13,4,FALSE)))","v":0},null,{"$f":"IF($C27=\"\",0,IF($S27>VLOOKUP($C27,PREMISSAS!$C$6:$J$13,4,FALSE),$S27-VLOOKUP($C27,PREMISSAS!$C$6:$J$13,4,FALSE),0))","v":0},null,null,null,null,null,"","","","","","",""]
[null,null,7,{"$f":"IF(D27=\"\",\"\",IF((D27+1)>'PERIODOS E FERIADOS'!$G$6,\"\",D27+1))","v":"2023-05-20"},"Sábado",null,null,null,null,null,null,null,0,null,0,null,null,null,0,null,null,null,{"$f":"IF($C28=\"\",0,IF($S28<=VLOOKUP($C28,PREMISSAS!$C$6:$J$13,4,FALSE),$S28,VLOOKUP($C28,PREMISSAS!$C$6:$J$13,4,FALSE)))","v":0},null,{"$f":"IF($C28=\"\",0,IF($S28>VLOOKUP($C28,PREMISSAS!$C$6:$J$13,4,FALSE),$S28-VLOOKUP($C28,PREMISSAS!$C$6:$J$13,4,FALSE),0))","v":0},null,null,null,null,null,"","","","","","",""]
[null,null,1,{"$f":"IF(D28=\"\",\"\",IF((D28+1)>'PERIODOS E FERIADOS'!$G$6,\"\",D28+1))","v":"2023-05-21"},"Domingo",null,null,null,null,null,null,null,0,null,0,null,null,null,0,null,null,null,{"$f":"IF($C29=\"\",0,IF($S29<=VLOOKUP($C29,PREMISSAS!$C$6:$J$13,4,FALSE),$S29,VLOOKUP($C29,PREMISSAS!$C$6:$J$13,4,FALSE)))","v":0},null,{"$f":"IF($C29=\"\",0,IF($S29>VLOOKUP($C29,PREMISSAS!$C$6:$J$13,4,FALSE),$S29-VLOOKUP($C29,PREMISSAS!$C$6:$J$13,4,FALSE),0))","v":0},null,null,null,null,null,"","","","","","",""]
[null,null,2,{"$f":"IF(D29=\"\",\"\",IF((D29+1)>'PERIODOS E FERIADOS'!$G$6,\"\",D29+1))","v":"2023-05-22"},"Segunda",null,null,null,null,null,null,null,0,null,0,null,null,null,0,null,null,null,{"$f":"IF($C30=\"\",0,IF($S30<=VLOOKUP($C30,PREMISSAS!$C$6:$J$13,4,FALSE),$S30,VLOOKUP($C30,PREMISSAS!$C$6:$J$13,4,FALSE)))","v":0},null,{"$f":"IF($C30=\"\",0,IF($S30>VLOOKUP($C30,PREMISSAS!$C$6:$J$13,4,FALSE),$S30-VLOOKUP($C30,PREMISSAS!$C$6:$J$13,4,FALSE),0))","v":0},null,null,null,null,null,"","","","","","",""]
[null,null,3,{"$f":"IF(D30=\"\",\"\",IF((D30+1)>'PERIODOS E FERIADOS'!$G$6,\"\",D30+1))","v":"2023-05-23"},"Terça",null,null,null,null,null,null,null,0,null,0,null,null,null,0,null,null,null,{"$f":"IF($C31=\"\",0,IF($S31<=VLOOKUP($C31,PREMISSAS!$C$6:$J$13,4,FALSE),$S31,VLOOKUP($C31,PREMISSAS!$C$6:$J$13,4,FALSE)))","v":0},null,{"$f":"IF($C31=\"\",0,IF($S31>VLOOKUP($C31,PREMISSAS!$C$6:$J$13,4,FALSE),$S31-VLOOKUP($C31,PREMISSAS!$C$6:$J$13,4,FALSE),0))","v":0},null,null,null,null,null,"","","","","","",""]
[null,null,4,{"$f":"IF(D31=\"\",\"\",IF((D31+1)>'PERIODOS E FERIADOS'!$G$6,\"\",D31+1))","v":"2023-05-24"},"Quarta",null,null,null,null,null,null,null,0,null,0,null,null,null,0,null,null,null,{"$f":"IF($C32=\"\",0,IF($S32<=VLOOKUP($C32,PREMISSAS!$C$6:$J$13,4,FALSE),$S32,VLOOKUP($C32,PREMISSAS!$C$6:$J$13,4,FALSE)))","v":0},null,{"$f":"IF($C32=\"\",0,IF($S32>VLOOKUP($C32,PREMISSAS!$C$6:$J$13,4,FALSE),$S32-VLOOKUP($C32,PREMISSAS!$C$6:$J$13,4,FALSE),0))","v":0},null,null,null,null,null,{"$f":"IF(OR(F32=\"\",F32=0,F32=\"FALTA\",F32=\"SUSPENSO\",F32=\"SUSPENSÃO\"),\"\",TEXT(F32,\"##\"\":\"\"##\"))","v":""},{"$f":"IF(OR(G32=\"\",G32=0,G32=\"FALTA\",G32=\"SUSPENSO\",G32=\"SUSPENSÃO\"),\"\",TEXT(G32,\"##\"\":\"\"##\"))","v":""},"","",{"$f":"IF(OR(J32=\"\",J32=0,J32=\"FALTA\",J32=\"SUSPENSO\",J32=\"SUSPENSÃO\"),\"\",TEXT(J32,\"##\"\":\"\"##\"))","v":""},{"$f":"IF(OR(K32=\"\",K32=0,K32=\"FALTA\",K32=\"SUSPENSO\",K32=\"SUSPENSÃO\"),\"\",TEXT(K32,\"##\"\":\"\"##\"))","v":""},""]
[null,null,5,{"$f":"IF(D32=\"\",\"\",IF((D32+1)>'PERIODOS E FERIADOS'!$G$6,\"\",D32+1))","v":"2023-05-25"},"Quinta",null,null,null,null,null,null,null,0,null,0,null,null,null,0,null,null,null,{"$f":"IF($C33=\"\",0,IF($S33<=VLOOKUP($C33,PREMISSAS!$C$6:$J$13,4,FALSE),$S33,VLOOKUP($C33,PREMISSAS!$C$6:$J$13,4,FALSE)))","v":0},null,{"$f":"IF($C33=\"\",0,IF($S33>VLOOKUP($C33,PREMISSAS!$C$6:$J$13,4,FALSE),$S33-VLOOKUP($C33,PREMISSAS!$C$6:$J$13,4,FALSE),0))","v":0},null,null,null,null,null,{"$f":"IF(OR(F33=\"\",F33=0,F33=\"FALTA\",F33=\"SUSPENSO\",F33=\"SUSPENSÃO\"),\"\",TEXT(F33,\"##\"\":\"\"##\"))","v":""},"","","","","",""]
[null,null,6,{"$f":"IF(D33=\"\",\"\",IF((D33+1)>'PERIODOS E FERIADOS'!$G$6,\"\",D33+1))","v":"2023-05-26"},"Sexta",null,null,null,null,null,null,null,0,null,0,null,null,null,0,null,null,null,{"$f":"IF($C34=\"\",0,IF($S34<=VLOOKUP($C34,PREMISSAS!$C$6:$J$13,4,FALSE),$S34,VLOOKUP($C34,PREMISSAS!$C$6:$J$13,4,FALSE)))","v":0},null,{"$f":"IF($C34=\"\",0,IF($S34>VLOOKUP($C34,PREMISSAS!$C$6:$J$13,4,FALSE),$S34-VLOOKUP($C34,PREMISSAS!$C$6:$J$13,4,FALSE),0))","v":0},null,null,null,null,null,"","","","","","",""]
[null,null,7,{"$f":"IF(D34=\"\",\"\",IF((D34+1)>'PERIODOS E FERIADOS'!$G$6,\"\",D34+1))","v":"2023-05-27"},"Sábado",null,null,null,null,null,null,null,0,null,0,null,null,null,0,null,null,null,{"$f":"IF($C35=\"\",0,IF($S35<=VLOOKUP($C35,PREMISSAS!$C$6:$J$13,4,FALSE),$S35,VLOOKUP($C35,PREMISSAS!$C$6:$J$13,4,FALSE)))","v":0},null,{"$f":"IF($C35=\"\",0,IF($S35>VLOOKUP($C35,PREMISSAS!$C$6:$J$13,4,FALSE),$S35-VLOOKUP($C35,PREMISSAS!$C$6:$J$13,4,FALSE),0))","v":0},null,null,null,null,null,"","","","","","",""]
[null,null,1,{"$f":"IF(D35=\"\",\"\",IF((D35+1)>'PERIODOS E FERIADOS'!$G$6,\"\",D35+1))","v":"2023-05-28"},"Domingo",null,null,null,null,null,null,null,0,null,0,null,null,null,0,null,null,null,{"$f":"IF($C36=\"\",0,IF($S36<=VLOOKUP($C36,PREMISSAS!$C$6:$J$13,4,FALSE),$S36,VLOOKUP($C36,PREMISSAS!$C$6:$J$13,4,FALSE)))","v":0},null,{"$f":"IF($C36=\"\",0,IF($S36>VLOOKUP($C36,PREMISSAS!$C$6:$J$13,4,FALSE),$S36-VLOOKUP($C36,PREMISSAS!$C$6:$J$13,4,FALSE),0))","v":0},null,null,null,null,null,"","","","","","",""]
[null,null,2,{"$f":"IF(D36=\"\",\"\",IF((D36+1)>'PERIODOS E FERIADOS'!$G$6,\"\",D36+1))","v":"2023-05-29"},"Segunda",null,null,null,null,null,null,null,0,null,0,null,null,null,0,null,null,null,{"$f":"IF($C37=\"\",0,IF($S37<=VLOOKUP($C37,PREMISSAS!$C$6:$J$13,4,FALSE),$S37,VLOOKUP($C37,PREMISSAS!$C$6:$J$13,4,FALSE)))","v":0},null,{"$f":"IF($C37=\"\",0,IF($S37>VLOOKUP($C37,PREMISSAS!$C$6:$J$13,4,FALSE),$S37-VLOOKUP($C37,PREMISSAS!$C$6:$J$13,4,FALSE),0))","v":0},null,null,null,null,null,"","","","","","",""]
[null,null,3,{"$f":"IF(D37=\"\",\"\",IF((D37+1)>'PERIODOS E FERIADOS'!$G$6,\"\",D37+1))","v":"2023-05-30"},"Terça",null,null,null,null,null,null,null,0,null,0,null,null,null,0,null,null,null,{"$f":"IF($C38=\"\",0,IF($S38<=VLOOKUP($C38,PREMISSAS!$C$6:$J$13,4,FALSE),$S38,VLOOKUP($C38,PREMISSAS!$C$6:$J$13,4,FALSE)))","v":0},null,{"$f":"IF($C38=\"\",0,IF($S38>VLOOKUP($C38,PREMISSAS!$C$6:$J$13,4,FALSE),$S38-VLOOKUP($C38,PREMISSAS!$C$6:$J$13,4,FALSE),0))","v":0},null,null,null,null,null,"","","","","","",""]
[null,null,4,{"$f":"IF(D38=\"\",\"\",IF((D38+1)>'PERIODOS E FERIADOS'!$G$6,\"\",D38+1))","v":"2023-05-31"},"Quarta",null,null,null,null,null,null,null,0,null,0,null,null,null,0,null,null,null,{"$f":"IF($C39=\"\",0,IF($S39<=VLOOKUP($C39,PREMISSAS!$C$6:$J$13,4,FALSE),$S39,VLOOKUP($C39,PREMISSAS!$C$6:$J$13,4,FALSE)))","v":0},null,{"$f":"IF($C39=\"\",0,IF($S39>VLOOKUP($C39,PREMISSAS!$C$6:$J$13,4,FALSE),$S39-VLOOKUP($C39,PREMISSAS!$C$6:$J$13,4,FALSE),0))","v":0},null,null,null,null,null,"","","","","","",""]
[]
[null,null,null,"TOTAIS",null,null,"Faltas / Suspensão",null,{"$f":"COUNTIF($F$9:$F$39,\"FALTA\")+COUNTIF($F$9:$F$39,\"SUSPENSÃO\")+COUNTIF($F$9:$F$39,\"SUSPENSO\")+COUNTIF($F$9:$F$39,\"SUSPENSAO\")","v":0},null,null,null,{"$f":"SUM($M$9:$M$39)","v":0},null,{"$f":"SUM($O$9:$O$39)","v":0},null,null,null,{"$f":"SUM(S$9:S$39)","v":0},null,{"$f":"$AK$41","v":0},null,{"$f":"SUM(W$9:W$39)","v":0},null,{"$f":"SUM(Y$9:Y$39)","v":0},null,null,null,null,null,null,null,null,null,null,null,{"$f":"SUM(AK9:AK39)","v":0}]
[]
[null,null,null,"OBSERVAÇÕES:"]

{"sheet":"FUNC 8","index":12,"n_rows":43,"n_cols":37,"rows_kept":43,"cut":false,"hidden":false,"merged":[[5,30,5,33],[40,3,40,5],[40,6,40,7],[40,8,40,10],[42,3,43,24],[18,26,18,27],[19,26,19,27],[3,3,4,27],[5,3,5,4],[5,5,5,10],[5,12,5,20],[5,22,5,24],[5,26,5,27]]}
[]
[]
[]
[null,null,null,{"$f":"'PERIODOS E FERIADOS'!$E$5","v":0}]
[]
[null,null,null,"Funcionário",null,{"$f":"FUNCIONÁRIOS!E12","v":8},null,null,null,null,null,null,"H.E. / Atrasos / A.N",null,null,null,null,null,null,null,null,null,"Distrib. H.E. p/ Faixa",null,null,null,"CARGA HORÁRIA",null,null,null,"ESPELHO"]
[]
[null,null,null,"Data","Dia Semana","Entrada","Saída","Entrada","Saída","Entrada","Saída",null,"H. Diária",null,"Atrasos",null,"Abona",null,"Horas Extras",null,"Adc. Noturno",null,{"$f":"PREMISSAS!H6","v":0.5},null,{"$f":"PREMISSAS!H12","v":1},2,"SEGUNDA",0.33333333333333331,2,null,"Entrada","Saída","Entrada","Saída","Entrada","Saída","AN "]
[null,null,{"$f":"IF(NOT(ISERROR(VLOOKUP(D9,rngFeriados,1,FALSE))),\"F\",IF(D9=\"\",\"\",WEEKDAY($D9,1)))","v":"F"},{"$f":"'PERIODOS E FERIADOS'!$E$6","v":"2023-05-01"},{"$f":"IF(D9=\"\",\"\",IF(WEEKDAY(D9,1)=1,\"Domingo\",IF(WEEKDAY(D9,1)=2,\"Segunda\",IF(WEEKDAY(D9,1)=3,\"Terça\",IF(WEEKDAY(D9,1)=4,\"Quarta\",IF(WEEKDAY(D9,1)=5,\"Quinta\",IF(WEEKDAY(D9,1)=6,\"Sexta\",IF(WEEKDAY(D9,1)=7,\"Sábado\"))))))))","v":"Segunda"},null,null,null,null,null,null,null,{"$f":"IF(ISERROR(IF(OR($AF9=\"\",$AF9=0),0,(IF(TEXT($AF9,\"[hh]:mm:ss\")<TEXT($AE9,\"[hh]:mm:ss\"),(1-$AE9+$AF9),$AF9-$AE9))+IF(OR($AH9=\"\",$AH9=0),0,(IF(TEXT($AH9,\"[hh]:mm:ss\")<TEXT($AG9,\"[hh]:mm:ss\"),(1-$AG9+$AH9),$AH9-$AG9))+IF(OR($AJ9=\"\",$AJ9=0),0,(IF(TEXT($AJ9,\"[hh]:mm:ss\")<TEXT($AI9,\"[hh]:mm:ss\"),(1-$AI9+$AJ9),$AJ9-$AI9)))))),0,IF(OR($AF9=\"\",$AF9=0),0,(IF(TEXT($AF9,\"[hh]:mm:ss\")<TEXT($AE9,\"[hh]:mm:ss\"),(1-$AE9+$AF9),$AF9-$AE9))+IF(OR($AH9=\"\",$AH9=0),0,(IF(TEXT($AH9,\"[hh]:mm:ss\")<TEXT($AG9,\"[hh]:mm:ss\"),(1-$AG9+$AH9),$AH9-$AG9))+IF(OR($AJ9=\"\",$AJ9=0),0,(IF(TEXT($AJ9,\"[hh]:mm:ss\")<TEXT($AI9,\"[hh]:mm:ss\"),(1-$AI9+$AJ9),$AJ9-$AI9))))))","v":0},null,{"$f":"IF($C9=\"\",0,IF(Q9=\"Sim\",0,IF(TEXT(IF(OR((VLOOKUP($C9,$Z$8:$AB$15,3,FALSE)-$M9)<0,$AE9=\"\"),0,(VLOOKUP($C9,$Z$8:$AB$15,3,FALSE)-$M9)),\"[hh]:mm\")<=TEXT(rngTolerancia,\"[hh]:mm\"),0,IF(OR((VLOOKUP($C9,$Z$8:$AB$15,3,FALSE)-$M9)<0,$AE9=\"\"),0,(VLOOKUP($C9,$Z$8:$AB$15,3,FALSE)-$M9)))))","v":0},null,null,null,{"$f":"IF($C9=\"\",0,IF(TEXT(IF(($M9-VLOOKUP($C9,$Z$8:$AB$15,3,FALSE))<0,0,($M9-VLOOKUP($C9,$Z$8:$AB$15,3,FALSE))),\"[hh]:mm\")<=TEXT(rngTolerancia,\"[hh]:mm\"),0,IF(($M9-VLOOKUP($C9,$Z$8:$AB$15,3,FALSE))<0,0,($M9-VLOOKUP($C9,$Z$8:$AB$15,3,FALSE)))))","v":0},null,null,null,{"$f":"IF($C9=\"\",0,IF($S9<=VLOOKUP($C9,PREMISSAS!$C$6:$J$13,4,FALSE),$S9,VLOOKUP($C9,PREMISSAS!$C$6:$J$13,4,FALSE)))","v":0},null,{"$f":"IF($C9=\"\",0,IF($S9>VLOOKUP($C9,PREMISSAS!$C$6:$J$13,4,FALSE),$S9-VLOOKUP($C9,PREMISSAS!$C$6:$J$13,4,FALSE),0))","v":0},3,"TERÇA",0.33333333333333331,3,null,{"$f":"IF(OR(F9=\"\",F9=0,F9=\"FALTA\",F9=\"SUSPENSO\",F9=\"SUSPENSÃO\"),\"\",TEXT(F9,\"##\"\":\"\"##\"))","v":""},{"$f":"IF(OR(G9=\"\",G9=0,G9=\"FALTA\",G9=\"SUSPENSO\",G9=\"SUSPENSÃO\"),\"\",TEXT(G9,\"##\"\":\"\"##\"))","v":""},"","",{"$f":"IF(OR(J9=\"\",J9=0,J9=\"FALTA\",J9=\"SUSPENSO\",J9=\"SUSPENSÃO\"),\"\",TEXT(J9,\"##\"\":\"\"##\"))","v":""},{"$f":"IF(OR(K9=\"\",K9=0,K9=\"FALTA\",K9=\"SUSPENSO\",K9=\"SUSPENSÃO\"),\"\",TEXT(K9,\"##\"\":\"\"##\"))","v":""},{"$f":"IF(OR(U9=\"\",U9=0,U9=\"FALTA\",U9=\"SUSPENSO\",U9=\"SUSPENSÃO\"),\"\",TEXT(TEXT(U9,\"00\"\":\"\"00\"),\"[hh]:mm\")*1)","v":""}]
[null,null,3,{"$f":"IF(D9=\"\",\"\",IF((D9+1)>'PERIODOS E FERIADOS'!$G$6,\"\",D9+1))","v":"2023-05-02"},{"$f":"IF(D10=\"\",\"\",IF(WEEKDAY(D10,1)=1,\"Domingo\",IF(WEEKDAY(D10,1)=2,\"Segunda\",IF(WEEKDAY(D10,1)=3,\"Terça\",IF(WEEKDAY(D10,1)=4,\"Quarta\",IF(WEEKDAY(D10,1)=5,\"Quinta\",IF(WEEKDAY(D10,1)=6,\"Sexta\",IF(WEEKDAY(D10,1)=7,\"Sábado\"))))))))","v":"Terça"},null,null,null,null,null,null,null,{"$f":"IF(ISERROR(IF(OR($AF10=\"\",$AF10=0),0,(IF(TEXT($AF10,\"[hh]:mm:ss\")<TEXT($AE10,\"[hh]:mm:ss\"),(1-$AE10+$AF10),$AF10-$AE10))+IF(OR($AH10=\"\",$AH10=0),0,(IF(TEXT($AH10,\"[hh]:mm:ss\")<TEXT($AG10,\"[hh]:mm:ss\"),(1-$AG10+$AH10),$AH10-$AG10))+IF(OR($AJ10=\"\",$AJ10=0),0,(IF(TEXT($AJ10,\"[hh]:mm:ss\")<TEXT($AI10,\"[hh]:mm:ss\"),(1-$AI10+$AJ10),$AJ10-$AI10)))))),0,IF(OR($AF10=\"\",$AF10=0),0,(IF(TEXT($AF10,\"[hh]:mm:ss\")<TEXT($AE10,\"[hh]:mm:ss\"),(1-$AE10+$AF10),$AF10-$AE10))+IF(OR($AH10=\"\",$AH10=0),0,(IF(TEXT($AH10,\"[hh]:mm:ss\")<TEXT($AG10,\"[hh]:mm:ss\"),(1-$AG10+$AH10),$AH10-$AG10))+IF(OR($AJ10=\"\",$AJ10=0),0,(IF(TEXT($AJ10,\"[hh]:mm:ss\")<TEXT($AI10,\"[hh]:mm:ss\"),(1-$AI10+$AJ10),$AJ10-$AI10))))))","v":0},null,{"$f":"IF($C10=\"\",0,IF(Q10=\"Sim\",0,IF(TEXT(IF(OR((VLOOKUP($C10,$Z$8:$AB$15,3,FALSE)-$M10)<0,$AE10=\"\"),0,(VLOOKUP($C10,$Z$8:$AB$15,3,FALSE)-$M10)),\"[hh]:mm\")<=TEXT(rngTolerancia,\"[hh]:mm\"),0,IF(OR((VLOOKUP($C10,$Z$8:$AB$15,3,FALSE)-$M10)<0,$AE10=\"\"),0,(VLOOKUP($C10,$Z$8:$AB$15,3,FALSE)-$M10)))))","v":0},null,null,null,0,null,null,null,{"$f":"IF($C10=\"\",0,IF($S10<=VLOOKUP($C10,PREMISSAS!$C$6:$J$13,4,FALSE),$S10,VLOOKUP($C10,PREMISSAS!$C$6:$J$13,4,FALSE)))","v":0},null,{"$f":"IF($C10=\"\",0,IF($S10>VLOOKUP($C10,PREMISSAS!$C$6:$J$13,4,FALSE),$S10-VLOOKUP($C10,PREMISSAS!$C$6:$J$13,4,FALSE),0))","v":0},4,"QUARTA",0.33333333333333331,4,null,{"$f":"IF(OR(F10=\"\",F10=0,F10=\"FALTA\",F10=\"SUSPENSO\",F10=\"SUSPENSÃO\"),\"\",TEXT(F10,\"##\"\":\"\"##\"))","v":""},"","","","","",{"$f":"IF(OR(U10=\"\",U10=0,U10=\"FALTA\",U10=\"SUSPENSO\",U10=\"SUSPENSÃO\"),\"\",TEXT(TEXT(U10,\"00\"\":\"\"00\"),\"[hh]:mm\")*1)","v":""}]
[null,null,4,{"$f":"IF(D10=\"\",\"\",IF((D10+1)>'PERIODOS E FERIADOS'!$G$6,\"\",D10+1))","v":"2023-05-03"},"Quarta",null,null,null,null,null,null,null,0,null,0,null,null,null,0,null,null,null,{"$f":"IF($C11=\"\",0,IF($S11<=VLOOKUP($C11,PREMISSAS!$C$6:$J$13,4,FALSE),$S11,VLOOKUP($C11,PREMISSAS!$C$6:$J$13,4,FALSE)))","v":0},null,{"$f":"IF($C11=\"\",0,IF($S11>VLOOKUP($C11,PREMISSAS!$C$6:$J$13,4,FALSE),$S11-VLOOKUP($C11,PREMISSAS!$C$6:$J$13,4,FALSE),0))","v":0},5,"QUINTA",0.33333333333333331,5,null,"","","","","","",""]
[null,null,5,{"$f":"IF(D11=\"\",\"\",IF((D11+1)>'PERIODOS E FERIADOS'!$G$6,\"\",D11+1))","v":"2023-05-04"},"Quinta",null,null,null,null,null,null,null,0,null,0,null,null,null,0,null,null,null,{"$f":"IF($C12=\"\",0,IF($S12<=VLOOKUP($C12,PREMISSAS!$C$6:$J$13,4,FALSE),$S12,VLOOKUP($C12,PREMISSAS!$C$6:$J$13,4,FALSE)))","v":0},null,{"$f":"IF($C12=\"\",0,IF($S12>VLOOKUP($C12,PREMISSAS!$C$6:$J$13,4,FALSE),$S12-VLOOKUP($C12,PREMISSAS!$C$6:$J$13,4,FALSE),0))","v":0},6,"SEXTA",0.33333333333333331,6,null,"","","","","","",{"$f":"IF(OR(U12=\"\",U12=0,U12=\"FALTA\",U12=\"SUSPENSO\",U12=\"SUSPENSÃO\"),\"\",TEXT(TEXT(U12,\"##\"\":\"\"##\"),\"[hh]:mm\")*1)","v":""}]
[null,null,6,{"$f":"IF(D12=\"\",\"\",IF((D12+1)>'PERIODOS E FERIADOS'!$G$6,\"\",D12+1))","v":"2023-05-05"},"Sexta",null,null,null,null,null,null,null,0,null,0,null,null,null,0,null,null,null,{"$f":"IF($C13=\"\",0,IF($S13<=VLOOKUP($C13,PREMISSAS!$C$6:$J$13,4,FALSE),$S13,VLOOKUP($C13,PREMISSAS!$C$6:$J$13,4,FALSE)))","v":0},null,{"$f":"IF($C13=\"\",0,IF($S13>VLOOKUP($C13,PREMISSAS!$C$6:$J$13,4,FALSE),$S13-VLOOKUP($C13,PREMISSAS!$C$6:$J$13,4,FALSE),0))","v":0},7,"SÁBADO",0.16666666666666666,7,null,"","","","","","",""]
[null,null,7,{"$f":"IF(D13=\"\",\"\",IF((D13+1)>'PERIODOS E FERIADOS'!$G$6,\"\",D13+1))","v":"2023-05-06"},"Sábado",null,null,null,null,null,null,null,0,null,0,null,null,null,0,null,null,null,{"$f":"IF($C14=\"\",0,IF($S14<=VLOOKUP($C14,PREMISSAS!$C$6:$J$13,4,FALSE),$S14,VLOOKUP($C14,PREMISSAS!$C$6:$J$13,4,FALSE)))","v":0},null,{"$f":"IF($C14=\"\",0,IF($S14>VLOOKUP($C14,PREMISSAS!$C$6:$J$13,4,FALSE),$S14-VLOOKUP($C14,PREMISSAS!$C$6:$J$13,4,FALSE),0))","v":0},1,"DOMINGO",0,1,null,"","","","","","",""]
[null,null,1,{"$f":"IF(D14=\"\",\"\",IF((D14+1)>'PERIODOS E FERIADOS'!$G$6,\"\",D14+1))","v":"2023-05-07"},"Domingo",null,null,null,null,null,null,null,0,null,0,null,null,null,0,null,null,null,{"$f":"IF($C15=\"\",0,IF($S15<=VLOOKUP($C15,PREMISSAS!$C$6:$J$13,4,FALSE),$S15,VLOOKUP($C15,PREMISSAS!$C$6:$J$13,4,FALSE)))","v":0},null,{"$f":"IF($C15=\"\",0,IF($S15>VLOOKUP($C15,PREMISSAS!$C$6:$J$13,4,FALSE),$S15-VLOOKUP($C15,PREMISSAS!$C$6:$J$13,4,FALSE),0))","v":0},"F","FERIADOS",0,"F",null,"","","","","","",""]
[null,null,2,{"$f":"IF(D15=\"\",\"\",IF((D15+1)>'PERIODOS E FERIADOS'!$G$6,\"\",D15+1))","v":"2023-05-08"},"Segunda",null,null,null,null,null,null,null,0,null,0,null,null,null,0,null,null,null,{"$f":"IF($C16=\"\",0,IF($S16<=VLOOKUP($C16,PREMISSAS!$C$6:$J$13,4,FALSE),$S16,VLOOKUP($C16,PREMISSAS!$C$6:$J$13,4,FALSE)))","v":0},null,{"$f":"IF($C16=\"\",0,IF($S16>VLOOKUP($C16,PREMISSAS!$C$6:$J$13,4,FALSE),$S16-VLOOKUP($C16,PREMISSAS!$C$6:$J$13,4,FALSE),0))","v":0},null,"TOTAL SEMANA",{"$f":"SUM(AB8:AB15)","v":1.8333333333333333},null,null,"","","","","","",""]
[null,null,3,{"$f":"IF(D16=\"\",\"\",IF((D16+1)>'PERIODOS E FERIADOS'!$G$6,\"\",D16+1))","v":"2023-05-09"},"Terça",null,null,null,null,null,null,null,0,null,0,null,null,null,0,null,null,null,{"$f":"IF($C17=\"\",0,IF($S17<=VLOOKUP($C17,PREMISSAS!$C$6:$J$13,4,FALSE),$S17,VLOOKUP($C17,PREMISSAS!$C$6:$J$13,4,FALSE)))","v":0},null,{"$f":"IF($C17=\"\",0,IF($S17>VLOOKUP($C17,PREMISSAS!$C$6:$J$13,4,FALSE),$S17-VLOOKUP($C17,PREMISSAS!$C$6:$J$13,4,FALSE),0))","v":0},null,"JORNADA MENSAL",{"$f":"AB16*5","v":9.1666666666666661},null,null,"","","","","","",""]
[null,null,4,{"$f":"IF(D17=\"\",\"\",IF((D17+1)>'PERIODOS E FERIADOS'!$G$6,\"\",D17+1))","v":"2023-05-10"},"Quarta",null,null,null,null,null,null,null,0,null,0,null,null,null,0,null,null,null,{"$f":"IF($C18=\"\",0,IF($S18<=VLOOKUP($C18,PREMISSAS!$C$6:$J$13,4,FALSE),$S18,VLOOKUP($C18,PREMISSAS!$C$6:$J$13,4,FALSE)))","v":0},null,{"$f":"IF($C18=\"\",0,IF($S18>VLOOKUP($C18,PREMISSAS!$C$6:$J$13,4,FALSE),$S18-VLOOKUP($C18,PREMISSAS!$C$6:$J$13,4,FALSE),0))","v":0},null,null,null,null,null,"","","","","","",""]
[null,null,5,{"$f":"IF(D18=\"\",\"\",IF((D18+1)>'PERIODOS E FERIADOS'!$G$6,\"\",D18+1))","v":"2023-05-11"},"Quinta",null,null,null,null,null,null,null,0,null,0,null,null,null,0,null,null,null,{"$f":"IF($C19=\"\",0,IF($S19<=VLOOKUP($C19,PREMISSAS!$C$6:$J$13,4,FALSE),$S19,VLOOKUP($C19,PREMISSAS!$C$6:$J$13,4,FALSE)))","v":0},null,{"$f":"IF($C19=\"\",0,IF($S19>VLOOKUP($C19,PREMISSAS!$C$6:$J$13,4,FALSE),$S19-VLOOKUP($C19,PREMISSAS!$C$6:$J$13,4,FALSE),0))","v":0},null,{"$f":"IF(AB$16>AB$23,\"Jornada Superior a permitida\",IF(AB$16<=AB$23,\"\"))","v":""},null,null,null,"","","","","","",""]
[null,null,6,{"$f":"IF(D19=\"\",\"\",IF((D19+1)>'PERIODOS E FERIADOS'!$G$6,\"\",D19+1))","v":"2023-05-12"},"Sexta",null,null,null,null,null,null,null,0,null,0,null,null,null,0,null,null,null,{"$f":"IF($C20=\"\",0,IF($S20<=VLOOKUP($C20,PREMISSAS!$C$6:$J$13,4,FALSE),$S20,VLOOKUP($C20,PREMISSAS!$C$6:$J$13,4,FALSE)))","v":0},null,{"$f":"IF($C20=\"\",0,IF($S20>VLOOKUP($C20,PREMISSAS!$C$6:$J$13,4,FALSE),$S20-VLOOKUP($C20,PREMISSAS!$C$6:$J$13,4,FALSE),0))","v":0},null,{"$f":"IF(AB$16>AB$23,\"\",IF(AB$16<=AB$23,\"Jornada Ok\"))","v":"Jornada Ok"},null,null,null,"","","","","","",""]
[null,null,7,{"$f":"IF(D20=\"\",\"\",IF((D20+1)>'PERIODOS E FERIADOS'!$G$6,\"\",D20+1))","v":"2023-05-13"},"Sábado",null,null,null,null,null,null,null,0,null,0,null,null,null,0,null,null,null,{"$f":"IF($C21=\"\",0,IF($S21<=VLOOKUP($C21,PREMISSAS!$C$6:$J$13,4,FALSE),$S21,VLOOKUP($C21,PREMISSAS!$C$6:$J$13,4,FALSE)))","v":0},null,{"$f":"IF($C21=\"\",0,IF($S21>VLOOKUP($C21,PREMISSAS!$C$6:$J$13,4,FALSE),$S21-VLOOKUP($C21,PREMISSAS!$C$6:$J$13,4,FALSE),0))","v":0},null,null,null,null,null,"","","","","","",""]
[null,null,1,{"$f":"IF(D21=\"\",\"\",IF((D21+1)>'PERIODOS E FERIADOS'!$G$6,\"\",D21+1))","v":"2023-05-14"},"Domingo",null,null,null,null,null,null,null,0,null,0,null,null,null,0,null,null,null,{"$f":"IF($C22=\"\",0,IF($S22<=VLOOKUP($C22,PREMISSAS!$C$6:$J$13,4,FALSE),$S22,VLOOKUP($C22,PREMISSAS!$C$6:$J$13,4,FALSE)))","v":0},null,{"$f":"IF($C22=\"\",0,IF($S22>VLOOKUP($C22,PREMISSAS!$C$6:$J$13,4,FALSE),$S22-VLOOKUP($C22,PREMISSAS!$C$6:$J$13,4,FALSE),0))","v":0},null,null,null,null,null,"","","","","","",""]
[null,null,2,{"$f":"IF(D22=\"\",\"\",IF((D22+1)>'PERIODOS E FERIADOS'!$G$6,\"\",D22+1))","v":"2023-05-15"},"Segunda",null,null,null,null,null,null,null,0,null,0,null,null,null,0,null,null,null,{"$f":"IF($C23=\"\",0,IF($S23<=VLOOKUP($C23,PREMISSAS!$C$6:$J$13,4,FALSE),$S23,VLOOKUP($C23,PREMISSAS!$C$6:$J$13,4,FALSE)))","v":0},null,{"$f":"IF($C23=\"\",0,IF($S23>VLOOKUP($C23,PREMISSAS!$C$6:$J$13,4,FALSE),$S23-VLOOKUP($C23,PREMISSAS!$C$6:$J$13,4,FALSE),0))","v":0},null,"Jornada Maxima",1.8333333333333333,null,null,"","","","","","",""]
[null,null,3,{"$f":"IF(D23=\"\",\"\",IF((D23+1)>'PERIODOS E FERIADOS'!$G$6,\"\",D23+1))","v":"2023-05-16"},"Terça",null,null,null,null,null,null,null,0,null,0,null,null,null,0,null,null,null,{"$f":"IF($C24=\"\",0,IF($S24<=VLOOKUP($C24,PREMISSAS!$C$6:$J$13,4,FALSE),$S24,VLOOKUP($C24,PREMISSAS!$C$6:$J$13,4,FALSE)))","v":0},null,{"$f":"IF($C24=\"\",0,IF($S24>VLOOKUP($C24,PREMISSAS!$C$6:$J$13,4,FALSE),$S24-VLOOKUP($C24,PREMISSAS!$C$6:$J$13,4,FALSE),0))","v":0},null,null,null,null,null,"","","","","","",""]
[null,null,4,{"$f":"IF(D24=\"\",\"\",IF((D24+1)>'PERIODOS E FERIADOS'!$G$6,\"\",D24+1))","v":"2023-05-17"},"Quarta",null,null,null,null,null,null,null,0,null,0,null,null,null,0,null,null,null,{"$f":"IF($C25=\"\",0,IF($S25<=VLOOKUP($C25,PREMISSAS!$C$6:$J$13,4,FALSE),$S25,VLOOKUP($C25,PREMISSAS!$C$6:$J$13,4,FALSE)))","v":0},null,{"$f":"IF($C25=\"\",0,IF($S25>VLOOKUP($C25,PREMISSAS!$C$6:$J$13,4,FALSE),$S25-VLOOKUP($C25,PREMISSAS!$C$6:$J$13,4,FALSE),0))","v":0},null,null,null,null,null,"","","","","","",""]
[null,null,5,{"$f":"IF(D25=\"\",\"\",IF((D25+1)>'PERIODOS E FERIADOS'!$G$6,\"\",D25+1))","v":"2023-05-18"},"Quinta",null,null,null,null,null,null,null,0,null,0,null,null,null,0,null,null,null,{"$f":"IF($C26=\"\",0,IF($S26<=VLOOKUP($C26,PREMISSAS!$C$6:$J$13,4,FALSE),$S26,VLOOKUP($C26,PREMISSAS!$C$6:$J$13,4,FALSE)))","v":0},null,{"$f":"IF($C26=\"\",0,IF($S26>VLOOKUP($C26,PREMISSAS!$C$6:$J$13,4,FALSE),$S26-VLOOKUP($C26,PREMISSAS!$C$6:$J$13,4,FALSE),0))","v":0},null,null,null,null,null,"","","","","","",""]
[null,null,6,{"$f":"IF(D26=\"\",\"\",IF((D26+1)>'PERIODOS E FERIADOS'!$G$6,\"\",D26+1))","v":"2023-05-19"},"Sexta",null,null,null,null,null,null,null,0,null,0,null,null,null,0,null,null,null,{"$f":"IF($C27=\"\",0,IF($S27<=VLOOKUP($C27,PREMISSAS!$C$6:$J$13,4,FALSE),$S27,VLOOKUP($C27,PREMISSAS!$C$6:$J$13,4,FALSE)))","v":0},null,{"$f":"IF($C27=\"\",0,IF($S27>VLOOKUP($C27,PREMISSAS!$C$6:$J$13,4,FALSE),$S27-VLOOKUP($C27,PREMISSAS!$C$6:$J$13,4,FALSE),0))","v":0},null,null,null,null,null,"","","","","","",""]
[null,null,7,{"$f":"IF(D27=\"\",\"\",IF((D27+1)>'PERIODOS E FERIADOS'!$G$6,\"\",D27+1))","v":"2023-05-20"},"Sábado",null,null,null,null,null,null,null,0,null,0,null,null,null,0,null,null,null,{"$f":"IF($C28=\"\",0,IF($S28<=VLOOKUP($C28,PREMISSAS!$C$6:$J$13,4,FALSE),$S28,VLOOKUP($C28,PREMISSAS!$C$6:$J$13,4,FALSE)))","v":0},null,{"$f":"IF($C28=\"\",0,IF($S28>VLOOKUP($C28,PREMISSAS!$C$6:$J$13,4,FALSE),$S28-VLOOKUP($C28,PREMISSAS!$C$6:$J$13,4,FALSE),0))","v":0},null,null,null,null,null,"","","","","","",""]
[null,null,1,{"$f":"IF(D28=\"\",\"\",IF((D28+1)>'PERIODOS E FERIADOS'!$G$6,\"\",D28+1))","v":"2023-05-21"},"Domingo",null,null,null,null,null,null,null,0,null,0,null,null,null,0,null,null,null,{"$f":"IF($C29=\"\",0,IF($S29<=VLOOKUP($C29,PREMISSAS!$C$6:$J$13,4,FALSE),$S29,VLOOKUP($C29,PREMISSAS!$C$6:$J$13,4,FALSE)))","v":0},null,{"$f":"IF($C29=\"\",0,IF($S29>VLOOKUP($C29,PREMISSAS!$C$6:$J$13,4,FALSE),$S29-VLOOKUP($C29,PREMISSAS!$C$6:$J$13,4,FALSE),0))","v":0},null,null,null,null,null,"","","","","","",""]
[null,null,2,{"$f":"IF(D29=\"\",\"\",IF((D29+1)>'PERIODOS E FERIADOS'!$G$6,\"\",D29+1))","v":"2023-05-22"},"Segunda",null,null,null,null,null,null,null,0,null,0,null,null,null,0,null,null,null,{"$f":"IF($C30=\"\",0,IF($S30<=VLOOKUP($C30,PREMISSAS!$C$6:$J$13,4,FALSE),$S30,VLOOKUP($C30,PREMISSAS!$C$6:$J$13,4,FALSE)))","v":0},null,{"$f":"IF($C30=\"\",0,IF($S30>VLOOKUP($C30,PREMISSAS!$C$6:$J$13,4,FALSE),$S30-VLOOKUP($C30,PREMISSAS!$C$6:$J$13,4,FALSE),0))","v":0},null,null,null,null,null,"","","","","","",""]
[null,null,3,{"$f":"IF(D30=\"\",\"\",IF((D30+1)>'PERIODOS E FERIADOS'!$G$6,\"\",D30+1))","v":"2023-05-23"},"Terça",null,null,null,null,null,null,null,0,null,0,null,null,null,0,null,null,null,{"$f":"IF($C31=\"\",0,IF($S31<=VLOOKUP($C31,PREMISSAS!$C$6:$J$13,4,FALSE),$S31,VLOOKUP($C31,PREMISSAS!$C$6:$J$13,4,FALSE)))","v":0},null,{"$f":"IF($C31=\"\",0,IF($S31>VLOOKUP($C31,PREMISSAS!$C$6:$J$13,4,FALSE),$S31-VLOOKUP($C31,PREMISSAS!$C$6:$J$13,4,FALSE),0))","v":0},null,null,null,null,null,"","","","","","",""]
[null,null,4,{"$f":"IF(D31=\"\",\"\",IF((D31+1)>'PERIODOS E FERIADOS'!$G$6,\"\",D31+1))","v":"2023-05-24"},"Quarta",null,null,null,null,null,null,null,0,null,0,null,null,null,0,null,null,null,{"$f":"IF($C32=\"\",0,IF($S32<=VLOOKUP($C32,PREMISSAS!$C$6:$J$13,4,FALSE),$S32,VLOOKUP($C32,PREMISSAS!$C$6:$J$13,4,FALSE)))","v":0},null,{"$f":"IF($C32=\"\",0,IF($S32>VLOOKUP($C32,PREMISSAS!$C$6:$J$13,4,FALSE),$S32-VLOOKUP($C32,PREMISSAS!$C$6:$J$13,4,FALSE),0))","v":0},null,null,null,null,null,{"$f":"IF(OR(F32=\"\",F32=0,F32=\"FALTA\",F32=\"SUSPENSO\",F32=\"SUSPENSÃO\"),\"\",TEXT(F32,\"##\"\":\"\"##\"))","v":""},{"$f":"IF(OR(G32=\"\",G32=0,G32=\"FALTA\",G32=\"SUSPENSO\",G32=\"SUSPENSÃO\"),\"\",TEXT(G32,\"##\"\":\"\"##\"))","v":""},"","",{"$f":"IF(OR(J32=\"\",J32=0,J32=\"FALTA\",J32=\"SUSPENSO\",J32=\"SUSPENSÃO\"),\"\",TEXT(J32,\"##\"\":\"\"##\"))","v":""},{"$f":"IF(OR(K32=\"\",K32=0,K32=\"FALTA\",K32=\"SUSPENSO\",K32=\"SUSPENSÃO\"),\"\",TEXT(K32,\"##\"\":\"\"##\"))","v":""},""]
[null,null,5,{"$f":"IF(D32=\"\",\"\",IF((D32+1)>'PERIODOS E FERIADOS'!$G$6,\"\",D32+1))","v":"2023-05-25"},"Quinta",null,null,null,null,null,null,null,0,null,0,null,null,null,0,null,null,null,{"$f":"IF($C33=\"\",0,IF($S33<=VLOOKUP($C33,PREMISSAS!$C$6:$J$13,4,FALSE),$S33,VLOOKUP($C33,PREMISSAS!$C$6:$J$13,4,FALSE)))","v":0},null,{"$f":"IF($C33=\"\",0,IF($S33>VLOOKUP($C33,PREMISSAS!$C$6:$J$13,4,FALSE),$S33-VLOOKUP($C33,PREMISSAS!$C$6:$J$13,4,FALSE),0))","v":0},null,null,null,null,null,{"$f":"IF(OR(F33=\"\",F33=0,F33=\"FALTA\",F33=\"SUSPENSO\",F33=\"SUSPENSÃO\"),\"\",TEXT(F33,\"##\"\":\"\"##\"))","v":""},"","","","","",""]
[null,null,6,{"$f":"IF(D33=\"\",\"\",IF((D33+1)>'PERIODOS E FERIADOS'!$G$6,\"\",D33+1))","v":"2023-05-26"},"Sexta",null,null,null,null,null,null,null,0,null,0,null,null,null,0,null,null,null,{"$f":"IF($C34=\"\",0,IF($S34<=VLOOKUP($C34,PREMISSAS!$C$6:$J$13,4,FALSE),$S34,VLOOKUP($C34,PREMISSAS!$C$6:$J$13,4,FALSE)))","v":0},null,{"$f":"IF($C34=\"\",0,IF($S34>VLOOKUP($C34,PREMISSAS!$C$6:$J$13,4,FALSE),$S34-VLOOKUP($C34,PREMISSAS!$C$6:$J$13,4,FALSE),0))","v":0},null,null,null,null,null,"","","","","","",""]
[null,null,7,{"$f":"IF(D34=\"\",\"\",IF((D34+1)>'PERIODOS E FERIADOS'!$G$6,\"\",D34+1))","v":"2023-05-27"},"Sábado",null,null,null,null,null,null,null,0,null,0,null,null,null,0,null,null,null,{"$f":"IF($C35=\"\",0,IF($S35<=VLOOKUP($C35,PREMISSAS!$C$6:$J$13,4,FALSE),$S35,VLOOKUP($C35,PREMISSAS!$C$6:$J$13,4,FALSE)))","v":0},null,{"$f":"IF($C35=\"\",0,IF($S35>VLOOKUP($C35,PREMISSAS!$C$6:$J$13,4,FALSE),$S35-VLOOKUP($C35,PREMISSAS!$C$6:$J$13,4,FALSE),0))","v":0},null,null,null,null,null,"","","","","","",""]
[null,null,1,{"$f":"IF(D35=\"\",\"\",IF((D35+1)>'PERIODOS E FERIADOS'!$G$6,\"\",D35+1))","v":"2023-05-28"},"Domingo",null,null,null,null,null,null,null,0,null,0,null,null,null,0,null,null,null,{"$f":"IF($C36=\"\",0,IF($S36<=VLOOKUP($C36,PREMISSAS!$C$6:$J$13,4,FALSE),$S36,VLOOKUP($C36,PREMISSAS!$C$6:$J$13,4,FALSE)))","v":0},null,{"$f":"IF($C36=\"\",0,IF($S36>VLOOKUP($C36,PREMISSAS!$C$6:$J$13,4,FALSE),$S36-VLOOKUP($C36,PREMISSAS!$C$6:$J$13,4,FALSE),0))","v":0},null,null,null,null,null,"","","","","","",""]
[null,null,2,{"$f":"IF(D36=\"\",\"\",IF((D36+1)>'PERIODOS E FERIADOS'!$G$6,\"\",D36+1))","v":"2023-05-29"},"Segunda",null,null,null,null,null,null,null,0,null,0,null,null,null,0,null,null,null,{"$f":"IF($C37=\"\",0,IF($S37<=VLOOKUP($C37,PREMISSAS!$C$6:$J$13,4,FALSE),$S37,VLOOKUP($C37,PREMISSAS!$C$6:$J$13,4,FALSE)))","v":0},null,{"$f":"IF($C37=\"\",0,IF($S37>VLOOKUP($C37,PREMISSAS!$C$6:$J$13,4,FALSE),$S37-VLOOKUP($C37,PREMISSAS!$C$6:$J$13,4,FALSE),0))","v":0},null,null,null,null,null,"","","","","","",""]
[null,null,3,{"$f":"IF(D37=\"\",\"\",IF((D37+1)>'PERIODOS E FERIADOS'!$G$6,\"\",D37+1))","v":"2023-05-30"},"Terça",null,null,null,null,null,null,null,0,null,0,null,null,null,0,null,null,null,{"$f":"IF($C38=\"\",0,IF($S38<=VLOOKUP($C38,PREMISSAS!$C$6:$J$13,4,FALSE),$S38,VLOOKUP($C38,PREMISSAS!$C$6:$J$13,4,FALSE)))","v":0},null,{"$f":"IF($C38=\"\",0,IF($S38>VLOOKUP($C38,PREMISSAS!$C$6:$J$13,4,FALSE),$S38-VLOOKUP($C38,PREMISSAS!$C$6:$J$13,4,FALSE),0))","v":0},null,null,null,null,null,"","","","","","",""]
[null,null,4,{"$f":"IF(D38=\"\",\"\",IF((D38+1)>'PERIODOS E FERIADOS'!$G$6,\"\",D38+1))","v":"2023-05-31"},"Quarta",null,null,null,null,null,null,null,0,null,0,null,null,null,0,null,null,null,{"$f":"IF($C39=\"\",0,IF($S39<=VLOOKUP($C39,PREMISSAS!$C$6:$J$13,4,FALSE),$S39,VLOOKUP($C39,PREMISSAS!$C$6:$J$13,4,FALSE)))","v":0},null,{"$f":"IF($C39=\"\",0,IF($S39>VLOOKUP($C39,PREMISSAS!$C$6:$J$13,4,FALSE),$S39-VLOOKUP($C39,PREMISSAS!$C$6:$J$13,4,FALSE),0))","v":0},null,null,null,null,null,"","","","","","",""]
[]
[null,null,null,"TOTAIS",null,null,"Faltas / Suspensão",null,{"$f":"COUNTIF($F$9:$F$39,\"FALTA\")+COUNTIF($F$9:$F$39,\"SUSPENSÃO\")+COUNTIF($F$9:$F$39,\"SUSPENSO\")+COUNTIF($F$9:$F$39,\"SUSPENSAO\")","v":0},null,null,null,{"$f":"SUM($M$9:$M$39)","v":0},null,{"$f":"SUM($O$9:$O$39)","v":0},null,null,null,{"$f":"SUM(S$9:S$39)","v":0},null,{"$f":"$AK$41","v":0},null,{"$f":"SUM(W$9:W$39)","v":0},null,{"$f":"SUM(Y$9:Y$39)","v":0},null,null,null,null,null,null,null,null,null,null,null,{"$f":"SUM(AK9:AK39)","v":0}]
[]
[null,null,null,"OBSERVAÇÕES:"]

{"sheet":"FUNC 9","index":13,"n_rows":43,"n_cols":37,"rows_kept":43,"cut":false,"hidden":false,"merged":[[5,30,5,33],[40,3,40,5],[40,6,40,7],[40,8,40,10],[42,3,43,24],[17,28,17,29],[18,26,18,27],[18,28,18,29],[19,26,19,27],[3,3,4,27],[5,3,5,4],[5,5,5,10],[5,12,5,20],[5,22,5,24],[5,26,5,27]]}
[]
[]
[]
[null,null,null,{"$f":"'PERIODOS E FERIADOS'!$E$5","v":0}]
[]
[null,null,null,"Funcionário",null,{"$f":"FUNCIONÁRIOS!E13","v":9},null,null,null,null,null,null,"H.E. / Atrasos / A.N",null,null,null,null,null,null,null,null,null,"Distrib. H.E. p/ Faixa",null,null,null,"CARGA HORÁRIA",null,null,null,"ESPELHO"]
[]
[null,null,null,"Data","Dia Semana","Entrada","Saída","Entrada","Saída","Entrada","Saída",null,"H. Diária",null,"Atrasos",null,"Abona",null,"Horas Extras",null,"Adc. Noturno",null,{"$f":"PREMISSAS!H6","v":0.5},null,{"$f":"PREMISSAS!H12","v":1},2,"SEGUNDA",0.33333333333333331,2,null,"Entrada","Saída","Entrada","Saída","Entrada","Saída","AN "]
[null,null,{"$f":"IF(NOT(ISERROR(VLOOKUP(D9,rngFeriados,1,FALSE))),\"F\",IF(D9=\"\",\"\",WEEKDAY($D9,1)))","v":"F"},{"$f":"'PERIODOS E FERIADOS'!$E$6","v":"2023-05-01"},{"$f":"IF(D9=\"\",\"\",IF(WEEKDAY(D9,1)=1,\"Domingo\",IF(WEEKDAY(D9,1)=2,\"Segunda\",IF(WEEKDAY(D9,1)=3,\"Terça\",IF(WEEKDAY(D9,1)=4,\"Quarta\",IF(WEEKDAY(D9,1)=5,\"Quinta\",IF(WEEKDAY(D9,1)=6,\"Sexta\",IF(WEEKDAY(D9,1)=7,\"Sábado\"))))))))","v":"Segunda"},null,null,null,null,null,null,null,{"$f":"IF(ISERROR(IF(OR($AF9=\"\",$AF9=0),0,(IF(TEXT($AF9,\"[hh]:mm:ss\")<TEXT($AE9,\"[hh]:mm:ss\"),(1-$AE9+$AF9),$AF9-$AE9))+IF(OR($AH9=\"\",$AH9=0),0,(IF(TEXT($AH9,\"[hh]:mm:ss\")<TEXT($AG9,\"[hh]:mm:ss\"),(1-$AG9+$AH9),$AH9-$AG9))+IF(OR($AJ9=\"\",$AJ9=0),0,(IF(TEXT($AJ9,\"[hh]:mm:ss\")<TEXT($AI9,\"[hh]:mm:ss\"),(1-$AI9+$AJ9),$AJ9-$AI9)))))),0,IF(OR($AF9=\"\",$AF9=0),0,(IF(TEXT($AF9,\"[hh]:mm:ss\")<TEXT($AE9,\"[hh]:mm:ss\"),(1-$AE9+$AF9),$AF9-$AE9))+IF(OR($AH9=\"\",$AH9=0),0,(IF(TEXT($AH9,\"[hh]:mm:ss\")<TEXT($AG9,\"[hh]:mm:ss\"),(1-$AG9+$AH9),$AH9-$AG9))+IF(OR($AJ9=\"\",$AJ9=0),0,(IF(TEXT($AJ9,\"[hh]:mm:ss\")<TEXT($AI9,\"[hh]:mm:ss\"),(1-$AI9+$AJ9),$AJ9-$AI9))))))","v":0},null,{"$f":"IF($C9=\"\",0,IF(Q9=\"Sim\",0,IF(TEXT(IF(OR((VLOOKUP($C9,$Z$8:$AB$15,3,FALSE)-$M9)<0,$AE9=\"\"),0,(VLOOKUP($C9,$Z$8:$AB$15,3,FALSE)-$M9)),\"[hh]:mm\")<=TEXT(rngTolerancia,\"[hh]:mm\"),0,IF(OR((VLOOKUP($C9,$Z$8:$AB$15,3,FALSE)-$M9)<0,$AE9=\"\"),0,(VLOOKUP($C9,$Z$8:$AB$15,3,FALSE)-$M9)))))","v":0},null,null,null,{"$f":"IF($C9=\"\",0,IF(TEXT(IF(($M9-VLOOKUP($C9,$Z$8:$AB$15,3,FALSE))<0,0,($M9-VLOOKUP($C9,$Z$8:$AB$15,3,FALSE))),\"[hh]:mm\")<=TEXT(rngTolerancia,\"[hh]:mm\"),0,IF(($M9-VLOOKUP($C9,$Z$8:$AB$15,3,FALSE))<0,0,($M9-VLOOKUP($C9,$Z$8:$AB$15,3,FALSE)))))","v":0},null,null,null,{"$f":"IF($C9=\"\",0,IF($S9<=VLOOKUP($C9,PREMISSAS!$C$6:$J$13,4,FALSE),$S9,VLOOKUP($C9,PREMISSAS!$C$6:$J$13,4,FALSE)))","v":0},null,{"$f":"IF($C9=\"\",0,IF($S9>VLOOKUP($C9,PREMISSAS!$C$6:$J$13,4,FALSE),$S9-VLOOKUP($C9,PREMISSAS!$C$6:$J$13,4,FALSE),0))","v":0},3,"TERÇA",0.33333333333333331,3,null,{"$f":"IF(OR(F9=\"\",F9=0,F9=\"FALTA\",F9=\"SUSPENSO\",F9=\"SUSPENSÃO\"),\"\",TEXT(F9,\"##\"\":\"\"##\"))","v":""},{"$f":"IF(OR(G9=\"\",G9=0,G9=\"FALTA\",G9=\"SUSPENSO\",G9=\"SUSPENSÃO\"),\"\",TEXT(G9,\"##\"\":\"\"##\"))","v":""},"","",{"$f":"IF(OR(J9=\"\",J9=0,J9=\"FALTA\",J9=\"SUSPENSO\",J9=\"SUSPENSÃO\"),\"\",TEXT(J9,\"##\"\":\"\"##\"))","v":""},{"$f":"IF(OR(K9=\"\",K9=0,K9=\"FALTA\",K9=\"SUSPENSO\",K9=\"SUSPENSÃO\"),\"\",TEXT(K9,\"##\"\":\"\"##\"))","v":""},{"$f":"IF(OR(U9=\"\",U9=0,U9=\"FALTA\",U9=\"SUSPENSO\",U9=\"SUSPENSÃO\"),\"\",TEXT(TEXT(U9,\"00\"\":\"\"00\"),\"[hh]:mm\")*1)","v":""}]
[null,null,3,{"$f":"IF(D9=\"\",\"\",IF((D9+1)>'PERIODOS E FERIADOS'!$G$6,\"\",D9+1))","v":"2023-05-02"},{"$f":"IF(D10=\"\",\"\",IF(WEEKDAY(D10,1)=1,\"Domingo\",IF(WEEKDAY(D10,1)=2,\"Segunda\",IF(WEEKDAY(D10,1)=3,\"Terça\",IF(WEEKDAY(D10,1)=4,\"Quarta\",IF(WEEKDAY(D10,1)=5,\"Quinta\",IF(WEEKDAY(D10,1)=6,\"Sexta\",IF(WEEKDAY(D10,1)=7,\"Sábado\"))))))))","v":"Terça"},null,null,null,null,null,null,null,{"$f":"IF(ISERROR(IF(OR($AF10=\"\",$AF10=0),0,(IF(TEXT($AF10,\"[hh]:mm:ss\")<TEXT($AE10,\"[hh]:mm:ss\"),(1-$AE10+$AF10),$AF10-$AE10))+IF(OR($AH10=\"\",$AH10=0),0,(IF(TEXT($AH10,\"[hh]:mm:ss\")<TEXT($AG10,\"[hh]:mm:ss\"),(1-$AG10+$AH10),$AH10-$AG10))+IF(OR($AJ10=\"\",$AJ10=0),0,(IF(TEXT($AJ10,\"[hh]:mm:ss\")<TEXT($AI10,\"[hh]:mm:ss\"),(1-$AI10+$AJ10),$AJ10-$AI10)))))),0,IF(OR($AF10=\"\",$AF10=0),0,(IF(TEXT($AF10,\"[hh]:mm:ss\")<TEXT($AE10,\"[hh]:mm:ss\"),(1-$AE10+$AF10),$AF10-$AE10))+IF(OR($AH10=\"\",$AH10=0),0,(IF(TEXT($AH10,\"[hh]:mm:ss\")<TEXT($AG10,\"[hh]:mm:ss\"),(1-$AG10+$AH10),$AH10-$AG10))+IF(OR($AJ10=\"\",$AJ10=0),0,(IF(TEXT($AJ10,\"[hh]:mm:ss\")<TEXT($AI10,\"[hh]:mm:ss\"),(1-$AI10+$AJ10),$AJ10-$AI10))))))","v":0},null,{"$f":"IF($C10=\"\",0,IF(Q10=\"Sim\",0,IF(TEXT(IF(OR((VLOOKUP($C10,$Z$8:$AB$15,3,FALSE)-$M10)<0,$AE10=\"\"),0,(VLOOKUP($C10,$Z$8:$AB$15,3,FALSE)-$M10)),\"[hh]:mm\")<=TEXT(rngTolerancia,\"[hh]:mm\"),0,IF(OR((VLOOKUP($C10,$Z$8:$AB$15,3,FALSE)-$M10)<0,$AE10=\"\"),0,(VLOOKUP($C10,$Z$8:$AB$15,3,FALSE)-$M10)))))","v":0},null,null,null,0,null,null,null,{"$f":"IF($C10=\"\",0,IF($S10<=VLOOKUP($C10,PREMISSAS!$C$6:$J$13,4,FALSE),$S10,VLOOKUP($C10,PREMISSAS!$C$6:$J$13,4,FALSE)))","v":0},null,{"$f":"IF($C10=\"\",0,IF($S10>VLOOKUP($C10,PREMISSAS!$C$6:$J$13,4,FALSE),$S10-VLOOKUP($C10,PREMISSAS!$C$6:$J$13,4,FALSE),0))","v":0},4,"QUARTA",0.33333333333333331,4,null,{"$f":"IF(OR(F10=\"\",F10=0,F10=\"FALTA\",F10=\"SUSPENSO\",F10=\"SUSPENSÃO\"),\"\",TEXT(F10,\"##\"\":\"\"##\"))","v":""},"","","","","",{"$f":"IF(OR(U10=\"\",U10=0,U10=\"FALTA\",U10=\"SUSPENSO\",U10=\"SUSPENSÃO\"),\"\",TEXT(TEXT(U10,\"00\"\":\"\"00\"),\"[hh]:mm\")*1)","v":""}]
[null,null,4,{"$f":"IF(D10=\"\",\"\",IF((D10+1)>'PERIODOS E FERIADOS'!$G$6,\"\",D10+1))","v":"2023-05-03"},"Quarta",null,null,null,null,null,null,null,0,null,0,null,null,null,0,null,null,null,{"$f":"IF($C11=\"\",0,IF($S11<=VLOOKUP($C11,PREMISSAS!$C$6:$J$13,4,FALSE),$S11,VLOOKUP($C11,PREMISSAS!$C$6:$J$13,4,FALSE)))","v":0},null,{"$f":"IF($C11=\"\",0,IF($S11>VLOOKUP($C11,PREMISSAS!$C$6:$J$13,4,FALSE),$S11-VLOOKUP($C11,PREMISSAS!$C$6:$J$13,4,FALSE),0))","v":0},5,"QUINTA",0.33333333333333331,5,null,"","","","","","",""]
[null,null,5,{"$f":"IF(D11=\"\",\"\",IF((D11+1)>'PERIODOS E FERIADOS'!$G$6,\"\",D11+1))","v":"2023-05-04"},"Quinta",null,null,null,null,null,null,null,0,null,0,null,null,null,0,null,null,null,{"$f":"IF($C12=\"\",0,IF($S12<=VLOOKUP($C12,PREMISSAS!$C$6:$J$13,4,FALSE),$S12,VLOOKUP($C12,PREMISSAS!$C$6:$J$13,4,FALSE)))","v":0},null,{"$f":"IF($C12=\"\",0,IF($S12>VLOOKUP($C12,PREMISSAS!$C$6:$J$13,4,FALSE),$S12-VLOOKUP($C12,PREMISSAS!$C$6:$J$13,4,FALSE),0))","v":0},6,"SEXTA",0.33333333333333331,6,null,"","","","","","",{"$f":"IF(OR(U12=\"\",U12=0,U12=\"FALTA\",U12=\"SUSPENSO\",U12=\"SUSPENSÃO\"),\"\",TEXT(TEXT(U12,\"##\"\":\"\"##\"),\"[hh]:mm\")*1)","v":""}]
[null,null,6,{"$f":"IF(D12=\"\",\"\",IF((D12+1)>'PERIODOS E FERIADOS'!$G$6,\"\",D12+1))","v":"2023-05-05"},"Sexta",null,null,null,null,null,null,null,0,null,0,null,null,null,0,null,null,null,{"$f":"IF($C13=\"\",0,IF($S13<=VLOOKUP($C13,PREMISSAS!$C$6:$J$13,4,FALSE),$S13,VLOOKUP($C13,PREMISSAS!$C$6:$J$13,4,FALSE)))","v":0},null,{"$f":"IF($C13=\"\",0,IF($S13>VLOOKUP($C13,PREMISSAS!$C$6:$J$13,4,FALSE),$S13-VLOOKUP($C13,PREMISSAS!$C$6:$J$13,4,FALSE),0))","v":0},7,"SÁBADO",0.16666666666666666,7,null,"","","","","","",""]
[null,null,7,{"$f":"IF(D13=\"\",\"\",IF((D13+1)>'PERIODOS E FERIADOS'!$G$6,\"\",D13+1))","v":"2023-05-06"},"Sábado",null,null,null,null,null,null,null,0,null,0,null,null,null,0,null,null,null,{"$f":"IF($C14=\"\",0,IF($S14<=VLOOKUP($C14,PREMISSAS!$C$6:$J$13,4,FALSE),$S14,VLOOKUP($C14,PREMISSAS!$C$6:$J$13,4,FALSE)))","v":0},null,{"$f":"IF($C14=\"\",0,IF($S14>VLOOKUP($C14,PREMISSAS!$C$6:$J$13,4,FALSE),$S14-VLOOKUP($C14,PREMISSAS!$C$6:$J$13,4,FALSE),0))","v":0},1,"DOMINGO",0,1,null,"","","","","","",""]
[null,null,1,{"$f":"IF(D14=\"\",\"\",IF((D14+1)>'PERIODOS E FERIADOS'!$G$6,\"\",D14+1))","v":"2023-05-07"},"Domingo",null,null,null,null,null,null,null,0,null,0,null,null,null,0,null,null,null,{"$f":"IF($C15=\"\",0,IF($S15<=VLOOKUP($C15,PREMISSAS!$C$6:$J$13,4,FALSE),$S15,VLOOKUP($C15,PREMISSAS!$C$6:$J$13,4,FALSE)))","v":0},null,{"$f":"IF($C15=\"\",0,IF($S15>VLOOKUP($C15,PREMISSAS!$C$6:$J$13,4,FALSE),$S15-VLOOKUP($C15,PREMISSAS!$C$6:$J$13,4,FALSE),0))","v":0},"F","FERIADOS",0,"F",null,"","","","","","",""]
[null,null,2,{"$f":"IF(D15=\"\",\"\",IF((D15+1)>'PERIODOS E FERIADOS'!$G$6,\"\",D15+1))","v":"2023-05-08"},"Segunda",null,null,null,null,null,null,null,0,null,0,null,null,null,0,null,null,null,{"$f":"IF($C16=\"\",0,IF($S16<=VLOOKUP($C16,PREMISSAS!$C$6:$J$13,4,FALSE),$S16,VLOOKUP($C16,PREMISSAS!$C$6:$J$13,4,FALSE)))","v":0},null,{"$f":"IF($C16=\"\",0,IF($S16>VLOOKUP($C16,PREMISSAS!$C$6:$J$13,4,FALSE),$S16-VLOOKUP($C16,PREMISSAS!$C$6:$J$13,4,FALSE),0))","v":0},null,"TOTAL SEMANA",{"$f":"SUM(AB8:AB15)","v":1.8333333333333333},null,null,"","","","","","",""]
[null,null,3,{"$f":"IF(D16=\"\",\"\",IF((D16+1)>'PERIODOS E FERIADOS'!$G$6,\"\",D16+1))","v":"2023-05-09"},"Terça",null,null,null,null,null,null,null,0,null,0,null,null,null,0,null,null,null,{"$f":"IF($C17=\"\",0,IF($S17<=VLOOKUP($C17,PREMISSAS!$C$6:$J$13,4,FALSE),$S17,VLOOKUP($C17,PREMISSAS!$C$6:$J$13,4,FALSE)))","v":0},null,{"$f":"IF($C17=\"\",0,IF($S17>VLOOKUP($C17,PREMISSAS!$C$6:$J$13,4,FALSE),$S17-VLOOKUP($C17,PREMISSAS!$C$6:$J$13,4,FALSE),0))","v":0},null,"JORNADA MENSAL",{"$f":"AB16*5","v":9.1666666666666661},null,null,"","","","","","",""]
[null,null,4,{"$f":"IF(D17=\"\",\"\",IF((D17+1)>'PERIODOS E FERIADOS'!$G$6,\"\",D17+1))","v":"2023-05-10"},"Quarta",null,null,null,null,null,null,null,0,null,0,null,null,null,0,null,null,null,{"$f":"IF($C18=\"\",0,IF($S18<=VLOOKUP($C18,PREMISSAS!$C$6:$J$13,4,FALSE),$S18,VLOOKUP($C18,PREMISSAS!$C$6:$J$13,4,FALSE)))","v":0},null,{"$f":"IF($C18=\"\",0,IF($S18>VLOOKUP($C18,PREMISSAS!$C$6:$J$13,4,FALSE),$S18-VLOOKUP($C18,PREMISSAS!$C$6:$J$13,4,FALSE),0))","v":0},null,null,null,{"$f":"IF(AD$16>AD$22,\"Jornada Superior a permitida\",IF(AD$16<=AD$22,\"\"))","v":""},null,"","","","","","",""]
[null,null,5,{"$f":"IF(D18=\"\",\"\",IF((D18+1)>'PERIODOS E FERIADOS'!$G$6,\"\",D18+1))","v":"2023-05-11"},"Quinta",null,null,null,null,null,null,null,0,null,0,null,null,null,0,null,null,null,{"$f":"IF($C19=\"\",0,IF($S19<=VLOOKUP($C19,PREMISSAS!$C$6:$J$13,4,FALSE),$S19,VLOOKUP($C19,PREMISSAS!$C$6:$J$13,4,FALSE)))","v":0},null,{"$f":"IF($C19=\"\",0,IF($S19>VLOOKUP($C19,PREMISSAS!$C$6:$J$13,4,FALSE),$S19-VLOOKUP($C19,PREMISSAS!$C$6:$J$13,4,FALSE),0))","v":0},null,{"$f":"IF(AB$16>AB$23,\"Jornada Superior a permitida\",IF(AB$16<=AB$23,\"\"))","v":""},null,null,null,"","","","","","",""]
[null,null,6,{"$f":"IF(D19=\"\",\"\",IF((D19+1)>'PERIODOS E FERIADOS'!$G$6,\"\",D19+1))","v":"2023-05-12"},"Sexta",null,null,null,null,null,null,null,0,null,0,null,null,null,0,null,null,null,{"$f":"IF($C20=\"\",0,IF($S20<=VLOOKUP($C20,PREMISSAS!$C$6:$J$13,4,FALSE),$S20,VLOOKUP($C20,PREMISSAS!$C$6:$J$13,4,FALSE)))","v":0},null,{"$f":"IF($C20=\"\",0,IF($S20>VLOOKUP($C20,PREMISSAS!$C$6:$J$13,4,FALSE),$S20-VLOOKUP($C20,PREMISSAS!$C$6:$J$13,4,FALSE),0))","v":0},null,{"$f":"IF(AB$16>AB$23,\"\",IF(AB$16<=AB$23,\"Jornada Ok\"))","v":"Jornada Ok"},null,null,null,"","","","","","",""]
[null,null,7,{"$f":"IF(D20=\"\",\"\",IF((D20+1)>'PERIODOS E FERIADOS'!$G$6,\"\",D20+1))","v":"2023-05-13"},"Sábado",null,null,null,null,null,null,null,0,null,0,null,null,null,0,null,null,null,{"$f":"IF($C21=\"\",0,IF($S21<=VLOOKUP($C21,PREMISSAS!$C$6:$J$13,4,FALSE),$S21,VLOOKUP($C21,PREMISSAS!$C$6:$J$13,4,FALSE)))","v":0},null,{"$f":"IF($C21=\"\",0,IF($S21>VLOOKUP($C21,PREMISSAS!$C$6:$J$13,4,FALSE),$S21-VLOOKUP($C21,PREMISSAS!$C$6:$J$13,4,FALSE),0))","v":0},null,null,null,null,null,"","","","","","",""]
[null,null,1,{"$f":"IF(D21=\"\",\"\",IF((D21+1)>'PERIODOS E FERIADOS'!$G$6,\"\",D21+1))","v":"2023-05-14"},"Domingo",null,null,null,null,null,null,null,0,null,0,null,null,null,0,null,null,null,{"$f":"IF($C22=\"\",0,IF($S22<=VLOOKUP($C22,PREMISSAS!$C$6:$J$13,4,FALSE),$S22,VLOOKUP($C22,PREMISSAS!$C$6:$J$13,4,FALSE)))","v":0},null,{"$f":"IF($C22=\"\",0,IF($S22>VLOOKUP($C22,PREMISSAS!$C$6:$J$13,4,FALSE),$S22-VLOOKUP($C22,PREMISSAS!$C$6:$J$13,4,FALSE),0))","v":0},null,null,null,"Jornada Maxima",1.8333333333333333,"","","","","","",""]
[null,null,2,{"$f":"IF(D22=\"\",\"\",IF((D22+1)>'PERIODOS E FERIADOS'!$G$6,\"\",D22+1))","v":"2023-05-15"},"Segunda",null,null,null,null,null,null,null,0,null,0,null,null,null,0,null,null,null,{"$f":"IF($C23=\"\",0,IF($S23<=VLOOKUP($C23,PREMISSAS!$C$6:$J$13,4,FALSE),$S23,VLOOKUP($C23,PREMISSAS!$C$6:$J$13,4,FALSE)))","v":0},null,{"$f":"IF($C23=\"\",0,IF($S23>VLOOKUP($C23,PREMISSAS!$C$6:$J$13,4,FALSE),$S23-VLOOKUP($C23,PREMISSAS!$C$6:$J$13,4,FALSE),0))","v":0},null,"Jornada Maxima",1.8333333333333333,null,null,"","","","","","",""]
[null,null,3,{"$f":"IF(D23=\"\",\"\",IF((D23+1)>'PERIODOS E FERIADOS'!$G$6,\"\",D23+1))","v":"2023-05-16"},"Terça",null,null,null,null,null,null,null,0,null,0,null,null,null,0,null,null,null,{"$f":"IF($C24=\"\",0,IF($S24<=VLOOKUP($C24,PREMISSAS!$C$6:$J$13,4,FALSE),$S24,VLOOKUP($C24,PREMISSAS!$C$6:$J$13,4,FALSE)))","v":0},null,{"$f":"IF($C24=\"\",0,IF($S24>VLOOKUP($C24,PREMISSAS!$C$6:$J$13,4,FALSE),$S24-VLOOKUP($C24,PREMISSAS!$C$6:$J$13,4,FALSE),0))","v":0},null,null,null,null,null,"","","","","","",""]
[null,null,4,{"$f":"IF(D24=\"\",\"\",IF((D24+1)>'PERIODOS E FERIADOS'!$G$6,\"\",D24+1))","v":"2023-05-17"},"Quarta",null,null,null,null,null,null,null,0,null,0,null,null,null,0,null,null,null,{"$f":"IF($C25=\"\",0,IF($S25<=VLOOKUP($C25,PREMISSAS!$C$6:$J$13,4,FALSE),$S25,VLOOKUP($C25,PREMISSAS!$C$6:$J$13,4,FALSE)))","v":0},null,{"$f":"IF($C25=\"\",0,IF($S25>VLOOKUP($C25,PREMISSAS!$C$6:$J$13,4,FALSE),$S25-VLOOKUP($C25,PREMISSAS!$C$6:$J$13,4,FALSE),0))","v":0},null,null,null,null,null,"","","","","","",""]
[null,null,5,{"$f":"IF(D25=\"\",\"\",IF((D25+1)>'PERIODOS E FERIADOS'!$G$6,\"\",D25+1))","v":"2023-05-18"},"Quinta",null,null,null,null,null,null,null,0,null,0,null,null,null,0,null,null,null,{"$f":"IF($C26=\"\",0,IF($S26<=VLOOKUP($C26,PREMISSAS!$C$6:$J$13,4,FALSE),$S26,VLOOKUP($C26,PREMISSAS!$C$6:$J$13,4,FALSE)))","v":0},null,{"$f":"IF($C26=\"\",0,IF($S26>VLOOKUP($C26,PREMISSAS!$C$6:$J$13,4,FALSE),$S26-VLOOKUP($C26,PREMISSAS!$C$6:$J$13,4,FALSE),0))","v":0},null,null,null,null,null,"","","","","","",""]
[null,null,6,{"$f":"IF(D26=\"\",\"\",IF((D26+1)>'PERIODOS E FERIADOS'!$G$6,\"\",D26+1))","v":"2023-05-19"},"Sexta",null,null,null,null,null,null,null,0,null,0,null,null,null,0,null,null,null,{"$f":"IF($C27=\"\",0,IF($S27<=VLOOKUP($C27,PREMISSAS!$C$6:$J$13,4,FALSE),$S27,VLOOKUP($C27,PREMISSAS!$C$6:$J$13,4,FALSE)))","v":0},null,{"$f":"IF($C27=\"\",0,IF($S27>VLOOKUP($C27,PREMISSAS!$C$6:$J$13,4,FALSE),$S27-VLOOKUP($C27,PREMISSAS!$C$6:$J$13,4,FALSE),0))","v":0},null,null,null,null,null,"","","","","","",""]
[null,null,7,{"$f":"IF(D27=\"\",\"\",IF((D27+1)>'PERIODOS E FERIADOS'!$G$6,\"\",D27+1))","v":"2023-05-20"},"Sábado",null,null,null,null,null,null,null,0,null,0,null,null,null,0,null,null,null,{"$f":"IF($C28=\"\",0,IF($S28<=VLOOKUP($C28,PREMISSAS!$C$6:$J$13,4,FALSE),$S28,VLOOKUP($C28,PREMISSAS!$C$6:$J$13,4,FALSE)))","v":0},null,{"$f":"IF($C28=\"\",0,IF($S28>VLOOKUP($C28,PREMISSAS!$C$6:$J$13,4,FALSE),$S28-VLOOKUP($C28,PREMISSAS!$C$6:$J$13,4,FALSE),0))","v":0},null,null,null,null,null,"","","","","","",""]
[null,null,1,{"$f":"IF(D28=\"\",\"\",IF((D28+1)>'PERIODOS E FERIADOS'!$G$6,\"\",D28+1))","v":"2023-05-21"},"Domingo",null,null,null,null,null,null,null,0,null,0,null,null,null,0,null,null,null,{"$f":"IF($C29=\"\",0,IF($S29<=VLOOKUP($C29,PREMISSAS!$C$6:$J$13,4,FALSE),$S29,VLOOKUP($C29,PREMISSAS!$C$6:$J$13,4,FALSE)))","v":0},null,{"$f":"IF($C29=\"\",0,IF($S29>VLOOKUP($C29,PREMISSAS!$C$6:$J$13,4,FALSE),$S29-VLOOKUP($C29,PREMISSAS!$C$6:$J$13,4,FALSE),0))","v":0},null,null,null,null,null,"","","","","","",""]
[null,null,2,{"$f":"IF(D29=\"\",\"\",IF((D29+1)>'PERIODOS E FERIADOS'!$G$6,\"\",D29+1))","v":"2023-05-22"},"Segunda",null,null,null,null,null,null,null,0,null,0,null,null,null,0,null,null,null,{"$f":"IF($C30=\"\",0,IF($S30<=VLOOKUP($C30,PREMISSAS!$C$6:$J$13,4,FALSE),$S30,VLOOKUP($C30,PREMISSAS!$C$6:$J$13,4,FALSE)))","v":0},null,{"$f":"IF($C30=\"\",0,IF($S30>VLOOKUP($C30,PREMISSAS!$C$6:$J$13,4,FALSE),$S30-VLOOKUP($C30,PREMISSAS!$C$6:$J$13,4,FALSE),0))","v":0},null,null,null,null,null,"","","","","","",""]
[null,null,3,{"$f":"IF(D30=\"\",\"\",IF((D30+1)>'PERIODOS E FERIADOS'!$G$6,\"\",D30+1))","v":"2023-05-23"},"Terça",null,null,null,null,null,null,null,0,null,0,null,null,null,0,null,null,null,{"$f":"IF($C31=\"\",0,IF($S31<=VLOOKUP($C31,PREMISSAS!$C$6:$J$13,4,FALSE),$S31,VLOOKUP($C31,PREMISSAS!$C$6:$J$13,4,FALSE)))","v":0},null,{"$f":"IF($C31=\"\",0,IF($S31>VLOOKUP($C31,PREMISSAS!$C$6:$J$13,4,FALSE),$S31-VLOOKUP($C31,PREMISSAS!$C$6:$J$13,4,FALSE),0))","v":0},null,null,null,null,null,"","","","","","",""]
[null,null,4,{"$f":"IF(D31=\"\",\"\",IF((D31+1)>'PERIODOS E FERIADOS'!$G$6,\"\",D31+1))","v":"2023-05-24"},"Quarta",null,null,null,null,null,null,null,0,null,0,null,null,null,0,null,null,null,{"$f":"IF($C32=\"\",0,IF($S32<=VLOOKUP($C32,PREMISSAS!$C$6:$J$13,4,FALSE),$S32,VLOOKUP($C32,PREMISSAS!$C$6:$J$13,4,FALSE)))","v":0},null,{"$f":"IF($C32=\"\",0,IF($S32>VLOOKUP($C32,PREMISSAS!$C$6:$J$13,4,FALSE),$S32-VLOOKUP($C32,PREMISSAS!$C$6:$J$13,4,FALSE),0))","v":0},null,null,null,null,null,{"$f":"IF(OR(F32=\"\",F32=0,F32=\"FALTA\",F32=\"SUSPENSO\",F32=\"SUSPENSÃO\"),\"\",TEXT(F32,\"##\"\":\"\"##\"))","v":""},{"$f":"IF(OR(G32=\"\",G32=0,G32=\"FALTA\",G32=\"SUSPENSO\",G32=\"SUSPENSÃO\"),\"\",TEXT(G32,\"##\"\":\"\"##\"))","v":""},"","",{"$f":"IF(OR(J32=\"\",J32=0,J32=\"FALTA\",J32=\"SUSPENSO\",J32=\"SUSPENSÃO\"),\"\",TEXT(J32,\"##\"\":\"\"##\"))","v":""},{"$f":"IF(OR(K32=\"\",K32=0,K32=\"FALTA\",K32=\"SUSPENSO\",K32=\"SUSPENSÃO\"),\"\",TEXT(K32,\"##\"\":\"\"##\"))","v":""},""]
[null,null,5,{"$f":"IF(D32=\"\",\"\",IF((D32+1)>'PERIODOS E FERIADOS'!$G$6,\"\",D32+1))","v":"2023-05-25"},"Quinta",null,null,null,null,null,null,null,0,null,0,null,null,null,0,null,null,null,{"$f":"IF($C33=\"\",0,IF($S33<=VLOOKUP($C33,PREMISSAS!$C$6:$J$13,4,FALSE),$S33,VLOOKUP($C33,PREMISSAS!$C$6:$J$13,4,FALSE)))","v":0},null,{"$f":"IF($C33=\"\",0,IF($S33>VLOOKUP($C33,PREMISSAS!$C$6:$J$13,4,FALSE),$S33-VLOOKUP($C33,PREMISSAS!$C$6:$J$13,4,FALSE),0))","v":0},null,null,null,null,null,{"$f":"IF(OR(F33=\"\",F33=0,F33=\"FALTA\",F33=\"SUSPENSO\",F33=\"SUSPENSÃO\"),\"\",TEXT(F33,\"##\"\":\"\"##\"))","v":""},"","","","","",""]
[null,null,6,{"$f":"IF(D33=\"\",\"\",IF((D33+1)>'PERIODOS E FERIADOS'!$G$6,\"\",D33+1))","v":"2023-05-26"},"Sexta",null,null,null,null,null,null,null,0,null,0,null,null,null,0,null,null,null,{"$f":"IF($C34=\"\",0,IF($S34<=VLOOKUP($C34,PREMISSAS!$C$6:$J$13,4,FALSE),$S34,VLOOKUP($C34,PREMISSAS!$C$6:$J$13,4,FALSE)))","v":0},null,{"$f":"IF($C34=\"\",0,IF($S34>VLOOKUP($C34,PREMISSAS!$C$6:$J$13,4,FALSE),$S34-VLOOKUP($C34,PREMISSAS!$C$6:$J$13,4,FALSE),0))","v":0},null,null,null,null,null,"","","","","","",""]
[null,null,7,{"$f":"IF(D34=\"\",\"\",IF((D34+1)>'PERIODOS E FERIADOS'!$G$6,\"\",D34+1))","v":"2023-05-27"},"Sábado",null,null,null,null,null,null,null,0,null,0,null,null,null,0,null,null,null,{"$f":"IF($C35=\"\",0,IF($S35<=VLOOKUP($C35,PREMISSAS!$C$6:$J$13,4,FALSE),$S35,VLOOKUP($C35,PREMISSAS!$C$6:$J$13,4,FALSE)))","v":0},null,{"$f":"IF($C35=\"\",0,IF($S35>VLOOKUP($C35,PREMISSAS!$C$6:$J$13,4,FALSE),$S35-VLOOKUP($C35,PREMISSAS!$C$6:$J$13,4,FALSE),0))","v":0},null,null,null,null,null,"","","","","","",""]
[null,null,1,{"$f":"IF(D35=\"\",\"\",IF((D35+1)>'PERIODOS E FERIADOS'!$G$6,\"\",D35+1))","v":"2023-05-28"},"Domingo",null,null,null,null,null,null,null,0,null,0,null,null,null,0,null,null,null,{"$f":"IF($C36=\"\",0,IF($S36<=VLOOKUP($C36,PREMISSAS!$C$6:$J$13,4,FALSE),$S36,VLOOKUP($C36,PREMISSAS!$C$6:$J$13,4,FALSE)))","v":0},null,{"$f":"IF($C36=\"\",0,IF($S36>VLOOKUP($C36,PREMISSAS!$C$6:$J$13,4,FALSE),$S36-VLOOKUP($C36,PREMISSAS!$C$6:$J$13,4,FALSE),0))","v":0},null,null,null,null,null,"","","","","","",""]
[null,null,2,{"$f":"IF(D36=\"\",\"\",IF((D36+1)>'PERIODOS E FERIADOS'!$G$6,\"\",D36+1))","v":"2023-05-29"},"Segunda",null,null,null,null,null,null,null,0,null,0,null,null,null,0,null,null,null,{"$f":"IF($C37=\"\",0,IF($S37<=VLOOKUP($C37,PREMISSAS!$C$6:$J$13,4,FALSE),$S37,VLOOKUP($C37,PREMISSAS!$C$6:$J$13,4,FALSE)))","v":0},null,{"$f":"IF($C37=\"\",0,IF($S37>VLOOKUP($C37,PREMISSAS!$C$6:$J$13,4,FALSE),$S37-VLOOKUP($C37,PREMISSAS!$C$6:$J$13,4,FALSE),0))","v":0},null,null,null,null,null,"","","","","","",""]
[null,null,3,{"$f":"IF(D37=\"\",\"\",IF((D37+1)>'PERIODOS E FERIADOS'!$G$6,\"\",D37+1))","v":"2023-05-30"},"Terça",null,null,null,null,null,null,null,0,null,0,null,null,null,0,null,null,null,{"$f":"IF($C38=\"\",0,IF($S38<=VLOOKUP($C38,PREMISSAS!$C$6:$J$13,4,FALSE),$S38,VLOOKUP($C38,PREMISSAS!$C$6:$J$13,4,FALSE)))","v":0},null,{"$f":"IF($C38=\"\",0,IF($S38>VLOOKUP($C38,PREMISSAS!$C$6:$J$13,4,FALSE),$S38-VLOOKUP($C38,PREMISSAS!$C$6:$J$13,4,FALSE),0))","v":0},null,null,null,null,null,"","","","","","",""]
[null,null,4,{"$f":"IF(D38=\"\",\"\",IF((D38+1)>'PERIODOS E FERIADOS'!$G$6,\"\",D38+1))","v":"2023-05-31"},"Quarta",null,null,null,null,null,null,null,0,null,0,null,null,null,0,null,null,null,{"$f":"IF($C39=\"\",0,IF($S39<=VLOOKUP($C39,PREMISSAS!$C$6:$J$13,4,FALSE),$S39,VLOOKUP($C39,PREMISSAS!$C$6:$J$13,4,FALSE)))","v":0},null,{"$f":"IF($C39=\"\",0,IF($S39>VLOOKUP($C39,PREMISSAS!$C$6:$J$13,4,FALSE),$S39-VLOOKUP($C39,PREMISSAS!$C$6:$J$13,4,FALSE),0))","v":0},null,null,null,null,null,"","","","","","",""]
[]
[null,null,null,"TOTAIS",null,null,"Faltas / Suspensão",null,{"$f":"COUNTIF($F$9:$F$39,\"FALTA\")+COUNTIF($F$9:$F$39,\"SUSPENSÃO\")+COUNTIF($F$9:$F$39,\"SUSPENSO\")+COUNTIF($F$9:$F$39,\"SUSPENSAO\")","v":0},null,null,null,{"$f":"SUM($M$9:$M$39)","v":0},null,{"$f":"SUM($O$9:$O$39)","v":0},null,null,null,{"$f":"SUM(S$9:S$39)","v":0},null,{"$f":"$AK$41","v":0},null,{"$f":"SUM(W$9:W$39)","v":0},null,{"$f":"SUM(Y$9:Y$39)","v":0},null,null,null,null,null,null,null,null,null,null,null,{"$f":"SUM(AK9:AK39)","v":0}]
[]
[null,null,null,"OBSERVAÇÕES:"]

{"sheet":"FUNC 10","index":14,"n_rows":43,"n_cols":37,"rows_kept":43,"cut":false,"hidden":false,"merged":[[5,30,5,33],[40,3,40,5],[40,6,40,7],[40,8,40,10],[42,3,43,24],[18,26,18,27],[19,26,19,27],[3,3,4,27],[5,3,5,4],[5,5,5,10],[5,12,5,20],[5,22,5,24],[5,26,5,27]]}
[]
[]
[]
[null,null,null,{"$f":"'PERIODOS E FERIADOS'!$E$5","v":0}]
[]
[null,null,null,"Funcionário",null,{"$f":"FUNCIONÁRIOS!E14","v":10},null,null,null,null,null,null,"H.E. / Atrasos / A.N",null,null,null,null,null,null,null,null,null,"Distrib. H.E. p/ Faixa",null,null,null,"CARGA HORÁRIA",null,null,null,"ESPELHO"]
[]
[null,null,null,"Data","Dia Semana","Entrada","Saída","Entrada","Saída","Entrada","Saída",null,"H. Diária",null,"Atrasos",null,"Abona",null,"Horas Extras",null,"Adc. Noturno",null,{"$f":"PREMISSAS!H6","v":0.5},null,{"$f":"PREMISSAS!H12","v":1},2,"SEGUNDA",0.33333333333333331,2,null,"Entrada","Saída","Entrada","Saída","Entrada","Saída","AN "]
[null,null,{"$f":"IF(NOT(ISERROR(VLOOKUP(D9,rngFeriados,1,FALSE))),\"F\",IF(D9=\"\",\"\",WEEKDAY($D9,1)))","v":"F"},{"$f":"'PERIODOS E FERIADOS'!$E$6","v":"2023-05-01"},{"$f":"IF(D9=\"\",\"\",IF(WEEKDAY(D9,1)=1,\"Domingo\",IF(WEEKDAY(D9,1)=2,\"Segunda\",IF(WEEKDAY(D9,1)=3,\"Terça\",IF(WEEKDAY(D9,1)=4,\"Quarta\",IF(WEEKDAY(D9,1)=5,\"Quinta\",IF(WEEKDAY(D9,1)=6,\"Sexta\",IF(WEEKDAY(D9,1)=7,\"Sábado\"))))))))","v":"Segunda"},null,null,null,null,null,null,null,{"$f":"IF(ISERROR(IF(OR($AF9=\"\",$AF9=0),0,(IF(TEXT($AF9,\"[hh]:mm:ss\")<TEXT($AE9,\"[hh]:mm:ss\"),(1-$AE9+$AF9),$AF9-$AE9))+IF(OR($AH9=\"\",$AH9=0),0,(IF(TEXT($AH9,\"[hh]:mm:ss\")<TEXT($AG9,\"[hh]:mm:ss\"),(1-$AG9+$AH9),$AH9-$AG9))+IF(OR($AJ9=\"\",$AJ9=0),0,(IF(TEXT($AJ9,\"[hh]:mm:ss\")<TEXT($AI9,\"[hh]:mm:ss\"),(1-$AI9+$AJ9),$AJ9-$AI9)))))),0,IF(OR($AF9=\"\",$AF9=0),0,(IF(TEXT($AF9,\"[hh]:mm:ss\")<TEXT($AE9,\"[hh]:mm:ss\"),(1-$AE9+$AF9),$AF9-$AE9))+IF(OR($AH9=\"\",$AH9=0),0,(IF(TEXT($AH9,\"[hh]:mm:ss\")<TEXT($AG9,\"[hh]:mm:ss\"),(1-$AG9+$AH9),$AH9-$AG9))+IF(OR($AJ9=\"\",$AJ9=0),0,(IF(TEXT($AJ9,\"[hh]:mm:ss\")<TEXT($AI9,\"[hh]:mm:ss\"),(1-$AI9+$AJ9),$AJ9-$AI9))))))","v":0},null,{"$f":"IF($C9=\"\",0,IF(Q9=\"Sim\",0,IF(TEXT(IF(OR((VLOOKUP($C9,$Z$8:$AB$15,3,FALSE)-$M9)<0,$AE9=\"\"),0,(VLOOKUP($C9,$Z$8:$AB$15,3,FALSE)-$M9)),\"[hh]:mm\")<=TEXT(rngTolerancia,\"[hh]:mm\"),0,IF(OR((VLOOKUP($C9,$Z$8:$AB$15,3,FALSE)-$M9)<0,$AE9=\"\"),0,(VLOOKUP($C9,$Z$8:$AB$15,3,FALSE)-$M9)))))","v":0},null,null,null,{"$f":"IF($C9=\"\",0,IF(TEXT(IF(($M9-VLOOKUP($C9,$Z$8:$AB$15,3,FALSE))<0,0,($M9-VLOOKUP($C9,$Z$8:$AB$15,3,FALSE))),\"[hh]:mm\")<=TEXT(rngTolerancia,\"[hh]:mm\"),0,IF(($M9-VLOOKUP($C9,$Z$8:$AB$15,3,FALSE))<0,0,($M9-VLOOKUP($C9,$Z$8:$AB$15,3,FALSE)))))","v":0},null,null,null,{"$f":"IF($C9=\"\",0,IF($S9<=VLOOKUP($C9,PREMISSAS!$C$6:$J$13,4,FALSE),$S9,VLOOKUP($C9,PREMISSAS!$C$6:$J$13,4,FALSE)))","v":0},null,{"$f":"IF($C9=\"\",0,IF($S9>VLOOKUP($C9,PREMISSAS!$C$6:$J$13,4,FALSE),$S9-VLOOKUP($C9,PREMISSAS!$C$6:$J$13,4,FALSE),0))","v":0},3,"TERÇA",0.33333333333333331,3,null,{"$f":"IF(OR(F9=\"\",F9=0,F9=\"FALTA\",F9=\"SUSPENSO\",F9=\"SUSPENSÃO\"),\"\",TEXT(F9,\"##\"\":\"\"##\"))","v":""},{"$f":"IF(OR(G9=\"\",G9=0,G9=\"FALTA\",G9=\"SUSPENSO\",G9=\"SUSPENSÃO\"),\"\",TEXT(G9,\"##\"\":\"\"##\"))","v":""},"","",{"$f":"IF(OR(J9=\"\",J9=0,J9=\"FALTA\",J9=\"SUSPENSO\",J9=\"SUSPENSÃO\"),\"\",TEXT(J9,\"##\"\":\"\"##\"))","v":""},{"$f":"IF(OR(K9=\"\",K9=0,K9=\"FALTA\",K9=\"SUSPENSO\",K9=\"SUSPENSÃO\"),\"\",TEXT(K9,\"##\"\":\"\"##\"))","v":""},{"$f":"IF(OR(U9=\"\",U9=0,U9=\"FALTA\",U9=\"SUSPENSO\",U9=\"SUSPENSÃO\"),\"\",TEXT(TEXT(U9,\"00\"\":\"\"00\"),\"[hh]:mm\")*1)","v":""}]
[null,null,3,{"$f":"IF(D9=\"\",\"\",IF((D9+1)>'PERIODOS E FERIADOS'!$G$6,\"\",D9+1))","v":"2023-05-02"},{"$f":"IF(D10=\"\",\"\",IF(WEEKDAY(D10,1)=1,\"Domingo\",IF(WEEKDAY(D10,1)=2,\"Segunda\",IF(WEEKDAY(D10,1)=3,\"Terça\",IF(WEEKDAY(D10,1)=4,\"Quarta\",IF(WEEKDAY(D10,1)=5,\"Quinta\",IF(WEEKDAY(D10,1)=6,\"Sexta\",IF(WEEKDAY(D10,1)=7,\"Sábado\"))))))))","v":"Terça"},null,null,null,null,null,null,null,{"$f":"IF(ISERROR(IF(OR($AF10=\"\",$AF10=0),0,(IF(TEXT($AF10,\"[hh]:mm:ss\")<TEXT($AE10,\"[hh]:mm:ss\"),(1-$AE10+$AF10),$AF10-$AE10))+IF(OR($AH10=\"\",$AH10=0),0,(IF(TEXT($AH10,\"[hh]:mm:ss\")<TEXT($AG10,\"[hh]:mm:ss\"),(1-$AG10+$AH10),$AH10-$AG10))+IF(OR($AJ10=\"\",$AJ10=0),0,(IF(TEXT($AJ10,\"[hh]:mm:ss\")<TEXT($AI10,\"[hh]:mm:ss\"),(1-$AI10+$AJ10),$AJ10-$AI10)))))),0,IF(OR($AF10=\"\",$AF10=0),0,(IF(TEXT($AF10,\"[hh]:mm:ss\")<TEXT($AE10,\"[hh]:mm:ss\"),(1-$AE10+$AF10),$AF10-$AE10))+IF(OR($AH10=\"\",$AH10=0),0,(IF(TEXT($AH10,\"[hh]:mm:ss\")<TEXT($AG10,\"[hh]:mm:ss\"),(1-$AG10+$AH10),$AH10-$AG10))+IF(OR($AJ10=\"\",$AJ10=0),0,(IF(TEXT($AJ10,\"[hh]:mm:ss\")<TEXT($AI10,\"[hh]:mm:ss\"),(1-$AI10+$AJ10),$AJ10-$AI10))))))","v":0},null,{"$f":"IF($C10=\"\",0,IF(Q10=\"Sim\",0,IF(TEXT(IF(OR((VLOOKUP($C10,$Z$8:$AB$15,3,FALSE)-$M10)<0,$AE10=\"\"),0,(VLOOKUP($C10,$Z$8:$AB$15,3,FALSE)-$M10)),\"[hh]:mm\")<=TEXT(rngTolerancia,\"[hh]:mm\"),0,IF(OR((VLOOKUP($C10,$Z$8:$AB$15,3,FALSE)-$M10)<0,$AE10=\"\"),0,(VLOOKUP($C10,$Z$8:$AB$15,3,FALSE)-$M10)))))","v":0},null,null,null,0,null,null,null,{"$f":"IF($C10=\"\",0,IF($S10<=VLOOKUP($C10,PREMISSAS!$C$6:$J$13,4,FALSE),$S10,VLOOKUP($C10,PREMISSAS!$C$6:$J$13,4,FALSE)))","v":0},null,{"$f":"IF($C10=\"\",0,IF($S10>VLOOKUP($C10,PREMISSAS!$C$6:$J$13,4,FALSE),$S10-VLOOKUP($C10,PREMISSAS!$C$6:$J$13,4,FALSE),0))","v":0},4,"QUARTA",0.33333333333333331,4,null,{"$f":"IF(OR(F10=\"\",F10=0,F10=\"FALTA\",F10=\"SUSPENSO\",F10=\"SUSPENSÃO\"),\"\",TEXT(F10,\"##\"\":\"\"##\"))","v":""},"","","","","",{"$f":"IF(OR(U10=\"\",U10=0,U10=\"FALTA\",U10=\"SUSPENSO\",U10=\"SUSPENSÃO\"),\"\",TEXT(TEXT(U10,\"00\"\":\"\"00\"),\"[hh]:mm\")*1)","v":""}]
[null,null,4,{"$f":"IF(D10=\"\",\"\",IF((D10+1)>'PERIODOS E FERIADOS'!$G$6,\"\",D10+1))","v":"2023-05-03"},"Quarta",null,null,null,null,null,null,null,0,null,0,null,null,null,0,null,null,null,{"$f":"IF($C11=\"\",0,IF($S11<=VLOOKUP($C11,PREMISSAS!$C$6:$J$13,4,FALSE),$S11,VLOOKUP($C11,PREMISSAS!$C$6:$J$13,4,FALSE)))","v":0},null,{"$f":"IF($C11=\"\",0,IF($S11>VLOOKUP($C11,PREMISSAS!$C$6:$J$13,4,FALSE),$S11-VLOOKUP($C11,PREMISSAS!$C$6:$J$13,4,FALSE),0))","v":0},5,"QUINTA",0.33333333333333331,5,null,"","","","","","",""]
[null,null,5,{"$f":"IF(D11=\"\",\"\",IF((D11+1)>'PERIODOS E FERIADOS'!$G$6,\"\",D11+1))","v":"2023-05-04"},"Quinta",null,null,null,null,null,null,null,0,null,0,null,null,null,0,null,null,null,{"$f":"IF($C12=\"\",0,IF($S12<=VLOOKUP($C12,PREMISSAS!$C$6:$J$13,4,FALSE),$S12,VLOOKUP($C12,PREMISSAS!$C$6:$J$13,4,FALSE)))","v":0},null,{"$f":"IF($C12=\"\",0,IF($S12>VLOOKUP($C12,PREMISSAS!$C$6:$J$13,4,FALSE),$S12-VLOOKUP($C12,PREMISSAS!$C$6:$J$13,4,FALSE),0))","v":0},6,"SEXTA",0.33333333333333331,6,null,"","","","","","",{"$f":"IF(OR(U12=\"\",U12=0,U12=\"FALTA\",U12=\"SUSPENSO\",U12=\"SUSPENSÃO\"),\"\",TEXT(TEXT(U12,\"##\"\":\"\"##\"),\"[hh]:mm\")*1)","v":""}]
[null,null,6,{"$f":"IF(D12=\"\",\"\",IF((D12+1)>'PERIODOS E FERIADOS'!$G$6,\"\",D12+1))","v":"2023-05-05"},"Sexta",null,null,null,null,null,null,null,0,null,0,null,null,null,0,null,null,null,{"$f":"IF($C13=\"\",0,IF($S13<=VLOOKUP($C13,PREMISSAS!$C$6:$J$13,4,FALSE),$S13,VLOOKUP($C13,PREMISSAS!$C$6:$J$13,4,FALSE)))","v":0},null,{"$f":"IF($C13=\"\",0,IF($S13>VLOOKUP($C13,PREMISSAS!$C$6:$J$13,4,FALSE),$S13-VLOOKUP($C13,PREMISSAS!$C$6:$J$13,4,FALSE),0))","v":0},7,"SÁBADO",0.16666666666666666,7,null,"","","","","","",""]
[null,null,7,{"$f":"IF(D13=\"\",\"\",IF((D13+1)>'PERIODOS E FERIADOS'!$G$6,\"\",D13+1))","v":"2023-05-06"},"Sábado",null,null,null,null,null,null,null,0,null,0,null,null,null,0,null,null,null,{"$f":"IF($C14=\"\",0,IF($S14<=VLOOKUP($C14,PREMISSAS!$C$6:$J$13,4,FALSE),$S14,VLOOKUP($C14,PREMISSAS!$C$6:$J$13,4,FALSE)))","v":0},null,{"$f":"IF($C14=\"\",0,IF($S14>VLOOKUP($C14,PREMISSAS!$C$6:$J$13,4,FALSE),$S14-VLOOKUP($C14,PREMISSAS!$C$6:$J$13,4,FALSE),0))","v":0},1,"DOMINGO",0,1,null,"","","","","","",""]
[null,null,1,{"$f":"IF(D14=\"\",\"\",IF((D14+1)>'PERIODOS E FERIADOS'!$G$6,\"\",D14+1))","v":"2023-05-07"},"Domingo",null,null,null,null,null,null,null,0,null,0,null,null,null,0,null,null,null,{"$f":"IF($C15=\"\",0,IF($S15<=VLOOKUP($C15,PREMISSAS!$C$6:$J$13,4,FALSE),$S15,VLOOKUP($C15,PREMISSAS!$C$6:$J$13,4,FALSE)))","v":0},null,{"$f":"IF($C15=\"\",0,IF($S15>VLOOKUP($C15,PREMISSAS!$C$6:$J$13,4,FALSE),$S15-VLOOKUP($C15,PREMISSAS!$C$6:$J$13,4,FALSE),0))","v":0},"F","FERIADOS",0,"F",null,"","","","","","",""]
[null,null,2,{"$f":"IF(D15=\"\",\"\",IF((D15+1)>'PERIODOS E FERIADOS'!$G$6,\"\",D15+1))","v":"2023-05-08"},"Segunda",null,null,null,null,null,null,null,0,null,0,null,null,null,0,null,null,null,{"$f":"IF($C16=\"\",0,IF($S16<=VLOOKUP($C16,PREMISSAS!$C$6:$J$13,4,FALSE),$S16,VLOOKUP($C16,PREMISSAS!$C$6:$J$13,4,FALSE)))","v":0},null,{"$f":"IF($C16=\"\",0,IF($S16>VLOOKUP($C16,PREMISSAS!$C$6:$J$13,4,FALSE),$S16-VLOOKUP($C16,PREMISSAS!$C$6:$J$13,4,FALSE),0))","v":0},null,"TOTAL SEMANA",{"$f":"SUM(AB8:AB15)","v":1.8333333333333333},null,null,"","","","","","",""]
[null,null,3,{"$f":"IF(D16=\"\",\"\",IF((D16+1)>'PERIODOS E FERIADOS'!$G$6,\"\",D16+1))","v":"2023-05-09"},"Terça",null,null,null,null,null,null,null,0,null,0,null,null,null,0,null,null,null,{"$f":"IF($C17=\"\",0,IF($S17<=VLOOKUP($C17,PREMISSAS!$C$6:$J$13,4,FALSE),$S17,VLOOKUP($C17,PREMISSAS!$C$6:$J$13,4,FALSE)))","v":0},null,{"$f":"IF($C17=\"\",0,IF($S17>VLOOKUP($C17,PREMISSAS!$C$6:$J$13,4,FALSE),$S17-VLOOKUP($C17,PREMISSAS!$C$6:$J$13,4,FALSE),0))","v":0},null,"JORNADA MENSAL",{"$f":"AB16*5","v":9.1666666666666661},null,null,"","","","","","",""]
[null,null,4,{"$f":"IF(D17=\"\",\"\",IF((D17+1)>'PERIODOS E FERIADOS'!$G$6,\"\",D17+1))","v":"2023-05-10"},"Quarta",null,null,null,null,null,null,null,0,null,0,null,null,null,0,null,null,null,{"$f":"IF($C18=\"\",0,IF($S18<=VLOOKUP($C18,PREMISSAS!$C$6:$J$13,4,FALSE),$S18,VLOOKUP($C18,PREMISSAS!$C$6:$J$13,4,FALSE)))","v":0},null,{"$f":"IF($C18=\"\",0,IF($S18>VLOOKUP($C18,PREMISSAS!$C$6:$J$13,4,FALSE),$S18-VLOOKUP($C18,PREMISSAS!$C$6:$J$13,4,FALSE),0))","v":0},null,null,null,null,null,"","","","","","",""]
[null,null,5,{"$f":"IF(D18=\"\",\"\",IF((D18+1)>'PERIODOS E FERIADOS'!$G$6,\"\",D18+1))","v":"2023-05-11"},"Quinta",null,null,null,null,null,null,null,0,null,0,null,null,null,0,null,null,null,{"$f":"IF($C19=\"\",0,IF($S19<=VLOOKUP($C19,PREMISSAS!$C$6:$J$13,4,FALSE),$S19,VLOOKUP($C19,PREMISSAS!$C$6:$J$13,4,FALSE)))","v":0},null,{"$f":"IF($C19=\"\",0,IF($S19>VLOOKUP($C19,PREMISSAS!$C$6:$J$13,4,FALSE),$S19-VLOOKUP($C19,PREMISSAS!$C$6:$J$13,4,FALSE),0))","v":0},null,{"$f":"IF(AB$16>AB$23,\"Jornada Superior a permitida\",IF(AB$16<=AB$23,\"\"))","v":""},null,null,null,"","","","","","",""]
[null,null,6,{"$f":"IF(D19=\"\",\"\",IF((D19+1)>'PERIODOS E FERIADOS'!$G$6,\"\",D19+1))","v":"2023-05-12"},"Sexta",null,null,null,null,null,null,null,0,null,0,null,null,null,0,null,null,null,{"$f":"IF($C20=\"\",0,IF($S20<=VLOOKUP($C20,PREMISSAS!$C$6:$J$13,4,FALSE),$S20,VLOOKUP($C20,PREMISSAS!$C$6:$J$13,4,FALSE)))","v":0},null,{"$f":"IF($C20=\"\",0,IF($S20>VLOOKUP($C20,PREMISSAS!$C$6:$J$13,4,FALSE),$S20-VLOOKUP($C20,PREMISSAS!$C$6:$J$13,4,FALSE),0))","v":0},null,{"$f":"IF(AB$16>AB$23,\"\",IF(AB$16<=AB$23,\"Jornada Ok\"))","v":"Jornada Ok"},null,null,null,"","","","","","",""]
[null,null,7,{"$f":"IF(D20=\"\",\"\",IF((D20+1)>'PERIODOS E FERIADOS'!$G$6,\"\",D20+1))","v":"2023-05-13"},"Sábado",null,null,null,null,null,null,null,0,null,0,null,null,null,0,null,null,null,{"$f":"IF($C21=\"\",0,IF($S21<=VLOOKUP($C21,PREMISSAS!$C$6:$J$13,4,FALSE),$S21,VLOOKUP($C21,PREMISSAS!$C$6:$J$13,4,FALSE)))","v":0},null,{"$f":"IF($C21=\"\",0,IF($S21>VLOOKUP($C21,PREMISSAS!$C$6:$J$13,4,FALSE),$S21-VLOOKUP($C21,PREMISSAS!$C$6:$J$13,4,FALSE),0))","v":0},null,null,null,null,null,"","","","","","",""]
[null,null,1,{"$f":"IF(D21=\"\",\"\",IF((D21+1)>'PERIODOS E FERIADOS'!$G$6,\"\",D21+1))","v":"2023-05-14"},"Domingo",null,null,null,null,null,null,null,0,null,0,null,null,null,0,null,null,null,{"$f":"IF($C22=\"\",0,IF($S22<=VLOOKUP($C22,PREMISSAS!$C$6:$J$13,4,FALSE),$S22,VLOOKUP($C22,PREMISSAS!$C$6:$J$13,4,FALSE)))","v":0},null,{"$f":"IF($C22=\"\",0,IF($S22>VLOOKUP($C22,PREMISSAS!$C$6:$J$13,4,FALSE),$S22-VLOOKUP($C22,PREMISSAS!$C$6:$J$13,4,FALSE),0))","v":0},null,null,null,null,null,"","","","","","",""]
[null,null,2,{"$f":"IF(D22=\"\",\"\",IF((D22+1)>'PERIODOS E FERIADOS'!$G$6,\"\",D22+1))","v":"2023-05-15"},"Segunda",null,null,null,null,null,null,null,0,null,0,null,null,null,0,null,null,null,{"$f":"IF($C23=\"\",0,IF($S23<=VLOOKUP($C23,PREMISSAS!$C$6:$J$13,4,FALSE),$S23,VLOOKUP($C23,PREMISSAS!$C$6:$J$13,4,FALSE)))","v":0},null,{"$f":"IF($C23=\"\",0,IF($S23>VLOOKUP($C23,PREMISSAS!$C$6:$J$13,4,FALSE),$S23-VLOOKUP($C23,PREMISSAS!$C$6:$J$13,4,FALSE),0))","v":0},null,"Jornada Maxima",1.8333333333333333,null,null,"","","","","","",""]
[null,null,3,{"$f":"IF(D23=\"\",\"\",IF((D23+1)>'PERIODOS E FERIADOS'!$G$6,\"\",D23+1))","v":"2023-05-16"},"Terça",null,null,null,null,null,null,null,0,null,0,null,null,null,0,null,null,null,{"$f":"IF($C24=\"\",0,IF($S24<=VLOOKUP($C24,PREMISSAS!$C$6:$J$13,4,FALSE),$S24,VLOOKUP($C24,PREMISSAS!$C$6:$J$13,4,FALSE)))","v":0},null,{"$f":"IF($C24=\"\",0,IF($S24>VLOOKUP($C24,PREMISSAS!$C$6:$J$13,4,FALSE),$S24-VLOOKUP($C24,PREMISSAS!$C$6:$J$13,4,FALSE),0))","v":0},null,null,null,null,null,"","","","","","",""]
[null,null,4,{"$f":"IF(D24=\"\",\"\",IF((D24+1)>'PERIODOS E FERIADOS'!$G$6,\"\",D24+1))","v":"2023-05-17"},"Quarta",null,null,null,null,null,null,null,0,null,0,null,null,null,0,null,null,null,{"$f":"IF($C25=\"\",0,IF($S25<=VLOOKUP($C25,PREMISSAS!$C$6:$J$13,4,FALSE),$S25,VLOOKUP($C25,PREMISSAS!$C$6:$J$13,4,FALSE)))","v":0},null,{"$f":"IF($C25=\"\",0,IF($S25>VLOOKUP($C25,PREMISSAS!$C$6:$J$13,4,FALSE),$S25-VLOOKUP($C25,PREMISSAS!$C$6:$J$13,4,FALSE),0))","v":0},null,null,null,null,null,"","","","","","",""]
[null,null,5,{"$f":"IF(D25=\"\",\"\",IF((D25+1)>'PERIODOS E FERIADOS'!$G$6,\"\",D25+1))","v":"2023-05-18"},"Quinta",null,null,null,null,null,null,null,0,null,0,null,null,null,0,null,null,null,{"$f":"IF($C26=\"\",0,IF($S26<=VLOOKUP($C26,PREMISSAS!$C$6:$J$13,4,FALSE),$S26,VLOOKUP($C26,PREMISSAS!$C$6:$J$13,4,FALSE)))","v":0},null,{"$f":"IF($C26=\"\",0,IF($S26>VLOOKUP($C26,PREMISSAS!$C$6:$J$13,4,FALSE),$S26-VLOOKUP($C26,PREMISSAS!$C$6:$J$13,4,FALSE),0))","v":0},null,null,null,null,null,"","","","","","",""]
[null,null,6,{"$f":"IF(D26=\"\",\"\",IF((D26+1)>'PERIODOS E FERIADOS'!$G$6,\"\",D26+1))","v":"2023-05-19"},"Sexta",null,null,null,null,null,null,null,0,null,0,null,null,null,0,null,null,null,{"$f":"IF($C27=\"\",0,IF($S27<=VLOOKUP($C27,PREMISSAS!$C$6:$J$13,4,FALSE),$S27,VLOOKUP($C27,PREMISSAS!$C$6:$J$13,4,FALSE)))","v":0},null,{"$f":"IF($C27=\"\",0,IF($S27>VLOOKUP($C27,PREMISSAS!$C$6:$J$13,4,FALSE),$S27-VLOOKUP($C27,PREMISSAS!$C$6:$J$13,4,FALSE),0))","v":0},null,null,null,null,null,"","","","","","",""]
[null,null,7,{"$f":"IF(D27=\"\",\"\",IF((D27+1)>'PERIODOS E FERIADOS'!$G$6,\"\",D27+1))","v":"2023-05-20"},"Sábado",null,null,null,null,null,null,null,0,null,0,null,null,null,0,null,null,null,{"$f":"IF($C28=\"\",0,IF($S28<=VLOOKUP($C28,PREMISSAS!$C$6:$J$13,4,FALSE),$S28,VLOOKUP($C28,PREMISSAS!$C$6:$J$13,4,FALSE)))","v":0},null,{"$f":"IF($C28=\"\",0,IF($S28>VLOOKUP($C28,PREMISSAS!$C$6:$J$13,4,FALSE),$S28-VLOOKUP($C28,PREMISSAS!$C$6:$J$13,4,FALSE),0))","v":0},null,null,null,null,null,"","","","","","",""]
[null,null,1,{"$f":"IF(D28=\"\",\"\",IF((D28+1)>'PERIODOS E FERIADOS'!$G$6,\"\",D28+1))","v":"2023-05-21"},"Domingo",null,null,null,null,null,null,null,0,null,0,null,null,null,0,null,null,null,{"$f":"IF($C29=\"\",0,IF($S29<=VLOOKUP($C29,PREMISSAS!$C$6:$J$13,4,FALSE),$S29,VLOOKUP($C29,PREMISSAS!$C$6:$J$13,4,FALSE)))","v":0},null,{"$f":"IF($C29=\"\",0,IF($S29>VLOOKUP($C29,PREMISSAS!$C$6:$J$13,4,FALSE),$S29-VLOOKUP($C29,PREMISSAS!$C$6:$J$13,4,FALSE),0))","v":0},null,null,null,null,null,"","","","","","",""]
[null,null,2,{"$f":"IF(D29=\"\",\"\",IF((D29+1)>'PERIODOS E FERIADOS'!$G$6,\"\",D29+1))","v":"2023-05-22"},"Segunda",null,null,null,null,null,null,null,0,null,0,null,null,null,0,null,null,null,{"$f":"IF($C30=\"\",0,IF($S30<=VLOOKUP($C30,PREMISSAS!$C$6:$J$13,4,FALSE),$S30,VLOOKUP($C30,PREMISSAS!$C$6:$J$13,4,FALSE)))","v":0},null,{"$f":"IF($C30=\"\",0,IF($S30>VLOOKUP($C30,PREMISSAS!$C$6:$J$13,4,FALSE),$S30-VLOOKUP($C30,PREMISSAS!$C$6:$J$13,4,FALSE),0))","v":0},null,null,null,null,null,"","","","","","",""]
[null,null,3,{"$f":"IF(D30=\"\",\"\",IF((D30+1)>'PERIODOS E FERIADOS'!$G$6,\"\",D30+1))","v":"2023-05-23"},"Terça",null,null,null,null,null,null,null,0,null,0,null,null,null,0,null,null,null,{"$f":"IF($C31=\"\",0,IF($S31<=VLOOKUP($C31,PREMISSAS!$C$6:$J$13,4,FALSE),$S31,VLOOKUP($C31,PREMISSAS!$C$6:$J$13,4,FALSE)))","v":0},null,{"$f":"IF($C31=\"\",0,IF($S31>VLOOKUP($C31,PREMISSAS!$C$6:$J$13,4,FALSE),$S31-VLOOKUP($C31,PREMISSAS!$C$6:$J$13,4,FALSE),0))","v":0},null,null,null,null,null,"","","","","","",""]
[null,null,4,{"$f":"IF(D31=\"\",\"\",IF((D31+1)>'PERIODOS E FERIADOS'!$G$6,\"\",D31+1))","v":"2023-05-24"},"Quarta",null,null,null,null,null,null,null,0,null,0,null,null,null,0,null,null,null,{"$f":"IF($C32=\"\",0,IF($S32<=VLOOKUP($C32,PREMISSAS!$C$6:$J$13,4,FALSE),$S32,VLOOKUP($C32,PREMISSAS!$C$6:$J$13,4,FALSE)))","v":0},null,{"$f":"IF($C32=\"\",0,IF($S32>VLOOKUP($C32,PREMISSAS!$C$6:$J$13,4,FALSE),$S32-VLOOKUP($C32,PREMISSAS!$C$6:$J$13,4,FALSE),0))","v":0},null,null,null,null,null,{"$f":"IF(OR(F32=\"\",F32=0,F32=\"FALTA\",F32=\"SUSPENSO\",F32=\"SUSPENSÃO\"),\"\",TEXT(F32,\"##\"\":\"\"##\"))","v":""},{"$f":"IF(OR(G32=\"\",G32=0,G32=\"FALTA\",G32=\"SUSPENSO\",G32=\"SUSPENSÃO\"),\"\",TEXT(G32,\"##\"\":\"\"##\"))","v":""},"","",{"$f":"IF(OR(J32=\"\",J32=0,J32=\"FALTA\",J32=\"SUSPENSO\",J32=\"SUSPENSÃO\"),\"\",TEXT(J32,\"##\"\":\"\"##\"))","v":""},{"$f":"IF(OR(K32=\"\",K32=0,K32=\"FALTA\",K32=\"SUSPENSO\",K32=\"SUSPENSÃO\"),\"\",TEXT(K32,\"##\"\":\"\"##\"))","v":""},""]
[null,null,5,{"$f":"IF(D32=\"\",\"\",IF((D32+1)>'PERIODOS E FERIADOS'!$G$6,\"\",D32+1))","v":"2023-05-25"},"Quinta",null,null,null,null,null,null,null,0,null,0,null,null,null,0,null,null,null,{"$f":"IF($C33=\"\",0,IF($S33<=VLOOKUP($C33,PREMISSAS!$C$6:$J$13,4,FALSE),$S33,VLOOKUP($C33,PREMISSAS!$C$6:$J$13,4,FALSE)))","v":0},null,{"$f":"IF($C33=\"\",0,IF($S33>VLOOKUP($C33,PREMISSAS!$C$6:$J$13,4,FALSE),$S33-VLOOKUP($C33,PREMISSAS!$C$6:$J$13,4,FALSE),0))","v":0},null,null,null,null,null,{"$f":"IF(OR(F33=\"\",F33=0,F33=\"FALTA\",F33=\"SUSPENSO\",F33=\"SUSPENSÃO\"),\"\",TEXT(F33,\"##\"\":\"\"##\"))","v":""},"","","","","",""]
[null,null,6,{"$f":"IF(D33=\"\",\"\",IF((D33+1)>'PERIODOS E FERIADOS'!$G$6,\"\",D33+1))","v":"2023-05-26"},"Sexta",null,null,null,null,null,null,null,0,null,0,null,null,null,0,null,null,null,{"$f":"IF($C34=\"\",0,IF($S34<=VLOOKUP($C34,PREMISSAS!$C$6:$J$13,4,FALSE),$S34,VLOOKUP($C34,PREMISSAS!$C$6:$J$13,4,FALSE)))","v":0},null,{"$f":"IF($C34=\"\",0,IF($S34>VLOOKUP($C34,PREMISSAS!$C$6:$J$13,4,FALSE),$S34-VLOOKUP($C34,PREMISSAS!$C$6:$J$13,4,FALSE),0))","v":0},null,null,null,null,null,"","","","","","",""]
[null,null,7,{"$f":"IF(D34=\"\",\"\",IF((D34+1)>'PERIODOS E FERIADOS'!$G$6,\"\",D34+1))","v":"2023-05-27"},"Sábado",null,null,null,null,null,null,null,0,null,0,null,null,null,0,null,null,null,{"$f":"IF($C35=\"\",0,IF($S35<=VLOOKUP($C35,PREMISSAS!$C$6:$J$13,4,FALSE),$S35,VLOOKUP($C35,PREMISSAS!$C$6:$J$13,4,FALSE)))","v":0},null,{"$f":"IF($C35=\"\",0,IF($S35>VLOOKUP($C35,PREMISSAS!$C$6:$J$13,4,FALSE),$S35-VLOOKUP($C35,PREMISSAS!$C$6:$J$13,4,FALSE),0))","v":0},null,null,null,null,null,"","","","","","",""]
[null,null,1,{"$f":"IF(D35=\"\",\"\",IF((D35+1)>'PERIODOS E FERIADOS'!$G$6,\"\",D35+1))","v":"2023-05-28"},"Domingo",null,null,null,null,null,null,null,0,null,0,null,null,null,0,null,null,null,{"$f":"IF($C36=\"\",0,IF($S36<=VLOOKUP($C36,PREMISSAS!$C$6:$J$13,4,FALSE),$S36,VLOOKUP($C36,PREMISSAS!$C$6:$J$13,4,FALSE)))","v":0},null,{"$f":"IF($C36=\"\",0,IF($S36>VLOOKUP($C36,PREMISSAS!$C$6:$J$13,4,FALSE),$S36-VLOOKUP($C36,PREMISSAS!$C$6:$J$13,4,FALSE),0))","v":0},null,null,null,null,null,"","","","","","",""]
[null,null,2,{"$f":"IF(D36=\"\",\"\",IF((D36+1)>'PERIODOS E FERIADOS'!$G$6,\"\",D36+1))","v":"2023-05-29"},"Segunda",null,null,null,null,null,null,null,0,null,0,null,null,null,0,null,null,null,{"$f":"IF($C37=\"\",0,IF($S37<=VLOOKUP($C37,PREMISSAS!$C$6:$J$13,4,FALSE),$S37,VLOOKUP($C37,PREMISSAS!$C$6:$J$13,4,FALSE)))","v":0},null,{"$f":"IF($C37=\"\",0,IF($S37>VLOOKUP($C37,PREMISSAS!$C$6:$J$13,4,FALSE),$S37-VLOOKUP($C37,PREMISSAS!$C$6:$J$13,4,FALSE),0))","v":0},null,null,null,null,null,"","","","","","",""]
[null,null,3,{"$f":"IF(D37=\"\",\"\",IF((D37+1)>'PERIODOS E FERIADOS'!$G$6,\"\",D37+1))","v":"2023-05-30"},"Terça",null,null,null,null,null,null,null,0,null,0,null,null,null,0,null,null,null,{"$f":"IF($C38=\"\",0,IF($S38<=VLOOKUP($C38,PREMISSAS!$C$6:$J$13,4,FALSE),$S38,VLOOKUP($C38,PREMISSAS!$C$6:$J$13,4,FALSE)))","v":0},null,{"$f":"IF($C38=\"\",0,IF($S38>VLOOKUP($C38,PREMISSAS!$C$6:$J$13,4,FALSE),$S38-VLOOKUP($C38,PREMISSAS!$C$6:$J$13,4,FALSE),0))","v":0},null,null,null,null,null,"","","","","","",""]
[null,null,4,{"$f":"IF(D38=\"\",\"\",IF((D38+1)>'PERIODOS E FERIADOS'!$G$6,\"\",D38+1))","v":"2023-05-31"},"Quarta",null,null,null,null,null,null,null,0,null,0,null,null,null,0,null,null,null,{"$f":"IF($C39=\"\",0,IF($S39<=VLOOKUP($C39,PREMISSAS!$C$6:$J$13,4,FALSE),$S39,VLOOKUP($C39,PREMISSAS!$C$6:$J$13,4,FALSE)))","v":0},null,{"$f":"IF($C39=\"\",0,IF($S39>VLOOKUP($C39,PREMISSAS!$C$6:$J$13,4,FALSE),$S39-VLOOKUP($C39,PREMISSAS!$C$6:$J$13,4,FALSE),0))","v":0},null,null,null,null,null,"","","","","","",""]
[]
[null,null,null,"TOTAIS",null,null,"Faltas / Suspensão",null,{"$f":"COUNTIF($F$9:$F$39,\"FALTA\")+COUNTIF($F$9:$F$39,\"SUSPENSÃO\")+COUNTIF($F$9:$F$39,\"SUSPENSO\")+COUNTIF($F$9:$F$39,\"SUSPENSAO\")","v":0},null,null,null,{"$f":"SUM($M$9:$M$39)","v":0},null,{"$f":"SUM($O$9:$O$39)","v":0},null,null,null,{"$f":"SUM(S$9:S$39)","v":0},null,{"$f":"$AK$41","v":0},null,{"$f":"SUM(W$9:W$39)","v":0},null,{"$f":"SUM(Y$9:Y$39)","v":0},null,null,null,null,null,null,null,null,null,null,null,{"$f":"SUM(AK9:AK39)","v":0}]
[]
[null,null,null,"OBSERVAÇÕES:"]

{"sheet":"FUNC 11","index":15,"n_rows":43,"n_cols":37,"rows_kept":43,"cut":false,"hidden":false,"merged":[[5,30,5,33],[40,3,40,5],[40,6,40,7],[40,8,40,10],[42,3,43,24],[18,26,18,27],[19,26,19,27],[3,3,4,27],[5,3,5,4],[5,5,5,10],[5,12,5,20],[5,22,5,24],[5,26,5,27]]}
[]
[]
[]
[null,null,null,{"$f":"'PERIODOS E FERIADOS'!$E$5","v":0}]
[]
[null,null,null,"Funcionário",null,{"$f":"FUNCIONÁRIOS!E15","v":11},null,null,null,null,null,null,"H.E. / Atrasos / A.N",null,null,null,null,null,null,null,null,null,"Distrib. H.E. p/ Faixa",null,null,null,"CARGA HORÁRIA",null,null,null,"ESPELHO"]
[]
[null,null,null,"Data","Dia Semana","Entrada","Saída","Entrada","Saída","Entrada","Saída",null,"H. Diária",null,"Atrasos",null,"Abona",null,"Horas Extras",null,"Adc. Noturno",null,{"$f":"PREMISSAS!H6","v":0.5},null,{"$f":"PREMISSAS!H12","v":1},2,"SEGUNDA",0.33333333333333331,2,null,"Entrada","Saída","Entrada","Saída","Entrada","Saída","AN "]
[null,null,{"$f":"IF(NOT(ISERROR(VLOOKUP(D9,rngFeriados,1,FALSE))),\"F\",IF(D9=\"\",\"\",WEEKDAY($D9,1)))","v":"F"},{"$f":"'PERIODOS E FERIADOS'!$E$6","v":"2023-05-01"},{"$f":"IF(D9=\"\",\"\",IF(WEEKDAY(D9,1)=1,\"Domingo\",IF(WEEKDAY(D9,1)=2,\"Segunda\",IF(WEEKDAY(D9,1)=3,\"Terça\",IF(WEEKDAY(D9,1)=4,\"Quarta\",IF(WEEKDAY(D9,1)=5,\"Quinta\",IF(WEEKDAY(D9,1)=6,\"Sexta\",IF(WEEKDAY(D9,1)=7,\"Sábado\"))))))))","v":"Segunda"},null,null,null,null,null,null,null,{"$f":"IF(ISERROR(IF(OR($AF9=\"\",$AF9=0),0,(IF(TEXT($AF9,\"[hh]:mm:ss\")<TEXT($AE9,\"[hh]:mm:ss\"),(1-$AE9+$AF9),$AF9-$AE9))+IF(OR($AH9=\"\",$AH9=0),0,(IF(TEXT($AH9,\"[hh]:mm:ss\")<TEXT($AG9,\"[hh]:mm:ss\"),(1-$AG9+$AH9),$AH9-$AG9))+IF(OR($AJ9=\"\",$AJ9=0),0,(IF(TEXT($AJ9,\"[hh]:mm:ss\")<TEXT($AI9,\"[hh]:mm:ss\"),(1-$AI9+$AJ9),$AJ9-$AI9)))))),0,IF(OR($AF9=\"\",$AF9=0),0,(IF(TEXT($AF9,\"[hh]:mm:ss\")<TEXT($AE9,\"[hh]:mm:ss\"),(1-$AE9+$AF9),$AF9-$AE9))+IF(OR($AH9=\"\",$AH9=0),0,(IF(TEXT($AH9,\"[hh]:mm:ss\")<TEXT($AG9,\"[hh]:mm:ss\"),(1-$AG9+$AH9),$AH9-$AG9))+IF(OR($AJ9=\"\",$AJ9=0),0,(IF(TEXT($AJ9,\"[hh]:mm:ss\")<TEXT($AI9,\"[hh]:mm:ss\"),(1-$AI9+$AJ9),$AJ9-$AI9))))))","v":0},null,{"$f":"IF($C9=\"\",0,IF(Q9=\"Sim\",0,IF(TEXT(IF(OR((VLOOKUP($C9,$Z$8:$AB$15,3,FALSE)-$M9)<0,$AE9=\"\"),0,(VLOOKUP($C9,$Z$8:$AB$15,3,FALSE)-$M9)),\"[hh]:mm\")<=TEXT(rngTolerancia,\"[hh]:mm\"),0,IF(OR((VLOOKUP($C9,$Z$8:$AB$15,3,FALSE)-$M9)<0,$AE9=\"\"),0,(VLOOKUP($C9,$Z$8:$AB$15,3,FALSE)-$M9)))))","v":0},null,null,null,{"$f":"IF($C9=\"\",0,IF(TEXT(IF(($M9-VLOOKUP($C9,$Z$8:$AB$15,3,FALSE))<0,0,($M9-VLOOKUP($C9,$Z$8:$AB$15,3,FALSE))),\"[hh]:mm\")<=TEXT(rngTolerancia,\"[hh]:mm\"),0,IF(($M9-VLOOKUP($C9,$Z$8:$AB$15,3,FALSE))<0,0,($M9-VLOOKUP($C9,$Z$8:$AB$15,3,FALSE)))))","v":0},null,null,null,{"$f":"IF($C9=\"\",0,IF($S9<=VLOOKUP($C9,PREMISSAS!$C$6:$J$13,4,FALSE),$S9,VLOOKUP($C9,PREMISSAS!$C$6:$J$13,4,FALSE)))","v":0},null,{"$f":"IF($C9=\"\",0,IF($S9>VLOOKUP($C9,PREMISSAS!$C$6:$J$13,4,FALSE),$S9-VLOOKUP($C9,PREMISSAS!$C$6:$J$13,4,FALSE),0))","v":0},3,"TERÇA",0.33333333333333331,3,null,{"$f":"IF(OR(F9=\"\",F9=0,F9=\"FALTA\",F9=\"SUSPENSO\",F9=\"SUSPENSÃO\"),\"\",TEXT(F9,\"##\"\":\"\"##\"))","v":""},{"$f":"IF(OR(G9=\"\",G9=0,G9=\"FALTA\",G9=\"SUSPENSO\",G9=\"SUSPENSÃO\"),\"\",TEXT(G9,\"##\"\":\"\"##\"))","v":""},"","",{"$f":"IF(OR(J9=\"\",J9=0,J9=\"FALTA\",J9=\"SUSPENSO\",J9=\"SUSPENSÃO\"),\"\",TEXT(J9,\"##\"\":\"\"##\"))","v":""},{"$f":"IF(OR(K9=\"\",K9=0,K9=\"FALTA\",K9=\"SUSPENSO\",K9=\"SUSPENSÃO\"),\"\",TEXT(K9,\"##\"\":\"\"##\"))","v":""},{"$f":"IF(OR(U9=\"\",U9=0,U9=\"FALTA\",U9=\"SUSPENSO\",U9=\"SUSPENSÃO\"),\"\",TEXT(TEXT(U9,\"00\"\":\"\"00\"),\"[hh]:mm\")*1)","v":""}]
[null,null,3,{"$f":"IF(D9=\"\",\"\",IF((D9+1)>'PERIODOS E FERIADOS'!$G$6,\"\",D9+1))","v":"2023-05-02"},{"$f":"IF(D10=\"\",\"\",IF(WEEKDAY(D10,1)=1,\"Domingo\",IF(WEEKDAY(D10,1)=2,\"Segunda\",IF(WEEKDAY(D10,1)=3,\"Terça\",IF(WEEKDAY(D10,1)=4,\"Quarta\",IF(WEEKDAY(D10,1)=5,\"Quinta\",IF(WEEKDAY(D10,1)=6,\"Sexta\",IF(WEEKDAY(D10,1)=7,\"Sábado\"))))))))","v":"Terça"},null,null,null,null,null,null,null,{"$f":"IF(ISERROR(IF(OR($AF10=\"\",$AF10=0),0,(IF(TEXT($AF10,\"[hh]:mm:ss\")<TEXT($AE10,\"[hh]:mm:ss\"),(1-$AE10+$AF10),$AF10-$AE10))+IF(OR($AH10=\"\",$AH10=0),0,(IF(TEXT($AH10,\"[hh]:mm:ss\")<TEXT($AG10,\"[hh]:mm:ss\"),(1-$AG10+$AH10),$AH10-$AG10))+IF(OR($AJ10=\"\",$AJ10=0),0,(IF(TEXT($AJ10,\"[hh]:mm:ss\")<TEXT($AI10,\"[hh]:mm:ss\"),(1-$AI10+$AJ10),$AJ10-$AI10)))))),0,IF(OR($AF10=\"\",$AF10=0),0,(IF(TEXT($AF10,\"[hh]:mm:ss\")<TEXT($AE10,\"[hh]:mm:ss\"),(1-$AE10+$AF10),$AF10-$AE10))+IF(OR($AH10=\"\",$AH10=0),0,(IF(TEXT($AH10,\"[hh]:mm:ss\")<TEXT($AG10,\"[hh]:mm:ss\"),(1-$AG10+$AH10),$AH10-$AG10))+IF(OR($AJ10=\"\",$AJ10=0),0,(IF(TEXT($AJ10,\"[hh]:mm:ss\")<TEXT($AI10,\"[hh]:mm:ss\"),(1-$AI10+$AJ10),$AJ10-$AI10))))))","v":0},null,{"$f":"IF($C10=\"\",0,IF(Q10=\"Sim\",0,IF(TEXT(IF(OR((VLOOKUP($C10,$Z$8:$AB$15,3,FALSE)-$M10)<0,$AE10=\"\"),0,(VLOOKUP($C10,$Z$8:$AB$15,3,FALSE)-$M10)),\"[hh]:mm\")<=TEXT(rngTolerancia,\"[hh]:mm\"),0,IF(OR((VLOOKUP($C10,$Z$8:$AB$15,3,FALSE)-$M10)<0,$AE10=\"\"),0,(VLOOKUP($C10,$Z$8:$AB$15,3,FALSE)-$M10)))))","v":0},null,null,null,0,null,null,null,{"$f":"IF($C10=\"\",0,IF($S10<=VLOOKUP($C10,PREMISSAS!$C$6:$J$13,4,FALSE),$S10,VLOOKUP($C10,PREMISSAS!$C$6:$J$13,4,FALSE)))","v":0},null,{"$f":"IF($C10=\"\",0,IF($S10>VLOOKUP($C10,PREMISSAS!$C$6:$J$13,4,FALSE),$S10-VLOOKUP($C10,PREMISSAS!$C$6:$J$13,4,FALSE),0))","v":0},4,"QUARTA",0.33333333333333331,4,null,{"$f":"IF(OR(F10=\"\",F10=0,F10=\"FALTA\",F10=\"SUSPENSO\",F10=\"SUSPENSÃO\"),\"\",TEXT(F10,\"##\"\":\"\"##\"))","v":""},"","","","","",{"$f":"IF(OR(U10=\"\",U10=0,U10=\"FALTA\",U10=\"SUSPENSO\",U10=\"SUSPENSÃO\"),\"\",TEXT(TEXT(U10,\"00\"\":\"\"00\"),\"[hh]:mm\")*1)","v":""}]
[null,null,4,{"$f":"IF(D10=\"\",\"\",IF((D10+1)>'PERIODOS E FERIADOS'!$G$6,\"\",D10+1))","v":"2023-05-03"},"Quarta",null,null,null,null,null,null,null,0,null,0,null,null,null,0,null,null,null,{"$f":"IF($C11=\"\",0,IF($S11<=VLOOKUP($C11,PREMISSAS!$C$6:$J$13,4,FALSE),$S11,VLOOKUP($C11,PREMISSAS!$C$6:$J$13,4,FALSE)))","v":0},null,{"$f":"IF($C11=\"\",0,IF($S11>VLOOKUP($C11,PREMISSAS!$C$6:$J$13,4,FALSE),$S11-VLOOKUP($C11,PREMISSAS!$C$6:$J$13,4,FALSE),0))","v":0},5,"QUINTA",0.33333333333333331,5,null,"","","","","","",""]
[null,null,5,{"$f":"IF(D11=\"\",\"\",IF((D11+1)>'PERIODOS E FERIADOS'!$G$6,\"\",D11+1))","v":"2023-05-04"},"Quinta",null,null,null,null,null,null,null,0,null,0,null,null,null,0,null,null,null,{"$f":"IF($C12=\"\",0,IF($S12<=VLOOKUP($C12,PREMISSAS!$C$6:$J$13,4,FALSE),$S12,VLOOKUP($C12,PREMISSAS!$C$6:$J$13,4,FALSE)))","v":0},null,{"$f":"IF($C12=\"\",0,IF($S12>VLOOKUP($C12,PREMISSAS!$C$6:$J$13,4,FALSE),$S12-VLOOKUP($C12,PREMISSAS!$C$6:$J$13,4,FALSE),0))","v":0},6,"SEXTA",0.33333333333333331,6,null,"","","","","","",{"$f":"IF(OR(U12=\"\",U12=0,U12=\"FALTA\",U12=\"SUSPENSO\",U12=\"SUSPENSÃO\"),\"\",TEXT(TEXT(U12,\"##\"\":\"\"##\"),\"[hh]:mm\")*1)","v":""}]
[null,null,6,{"$f":"IF(D12=\"\",\"\",IF((D12+1)>'PERIODOS E FERIADOS'!$G$6,\"\",D12+1))","v":"2023-05-05"},"Sexta",null,null,null,null,null,null,null,0,null,0,null,null,null,0,null,null,null,{"$f":"IF($C13=\"\",0,IF($S13<=VLOOKUP($C13,PREMISSAS!$C$6:$J$13,4,FALSE),$S13,VLOOKUP($C13,PREMISSAS!$C$6:$J$13,4,FALSE)))","v":0},null,{"$f":"IF($C13=\"\",0,IF($S13>VLOOKUP($C13,PREMISSAS!$C$6:$J$13,4,FALSE),$S13-VLOOKUP($C13,PREMISSAS!$C$6:$J$13,4,FALSE),0))","v":0},7,"SÁBADO",0.16666666666666666,7,null,"","","","","","",""]
[null,null,7,{"$f":"IF(D13=\"\",\"\",IF((D13+1)>'PERIODOS E FERIADOS'!$G$6,\"\",D13+1))","v":"2023-05-06"},"Sábado",null,null,null,null,null,null,null,0,null,0,null,null,null,0,null,null,null,{"$f":"IF($C14=\"\",0,IF($S14<=VLOOKUP($C14,PREMISSAS!$C$6:$J$13,4,FALSE),$S14,VLOOKUP($C14,PREMISSAS!$C$6:$J$13,4,FALSE)))","v":0},null,{"$f":"IF($C14=\"\",0,IF($S14>VLOOKUP($C14,PREMISSAS!$C$6:$J$13,4,FALSE),$S14-VLOOKUP($C14,PREMISSAS!$C$6:$J$13,4,FALSE),0))","v":0},1,"DOMINGO",0,1,null,"","","","","","",""]
[null,null,1,{"$f":"IF(D14=\"\",\"\",IF((D14+1)>'PERIODOS E FERIADOS'!$G$6,\"\",D14+1))","v":"2023-05-07"},"Domingo",null,null,null,null,null,null,null,0,null,0,null,null,null,0,null,null,null,{"$f":"IF($C15=\"\",0,IF($S15<=VLOOKUP($C15,PREMISSAS!$C$6:$J$13,4,FALSE),$S15,VLOOKUP($C15,PREMISSAS!$C$6:$J$13,4,FALSE)))","v":0},null,{"$f":"IF($C15=\"\",0,IF($S15>VLOOKUP($C15,PREMISSAS!$C$6:$J$13,4,FALSE),$S15-VLOOKUP($C15,PREMISSAS!$C$6:$J$13,4,FALSE),0))","v":0},"F","FERIADOS",0,"F",null,"","","","","","",""]
[null,null,2,{"$f":"IF(D15=\"\",\"\",IF((D15+1)>'PERIODOS E FERIADOS'!$G$6,\"\",D15+1))","v":"2023-05-08"},"Segunda",null,null,null,null,null,null,null,0,null,0,null,null,null,0,null,null,null,{"$f":"IF($C16=\"\",0,IF($S16<=VLOOKUP($C16,PREMISSAS!$C$6:$J$13,4,FALSE),$S16,VLOOKUP($C16,PREMISSAS!$C$6:$J$13,4,FALSE)))","v":0},null,{"$f":"IF($C16=\"\",0,IF($S16>VLOOKUP($C16,PREMISSAS!$C$6:$J$13,4,FALSE),$S16-VLOOKUP($C16,PREMISSAS!$C$6:$J$13,4,FALSE),0))","v":0},null,"TOTAL SEMANA",{"$f":"SUM(AB8:AB15)","v":1.8333333333333333},null,null,"","","","","","",""]
[null,null,3,{"$f":"IF(D16=\"\",\"\",IF((D16+1)>'PERIODOS E FERIADOS'!$G$6,\"\",D16+1))","v":"2023-05-09"},"Terça",null,null,null,null,null,null,null,0,null,0,null,null,null,0,null,null,null,{"$f":"IF($C17=\"\",0,IF($S17<=VLOOKUP($C17,PREMISSAS!$C$6:$J$13,4,FALSE),$S17,VLOOKUP($C17,PREMISSAS!$C$6:$J$13,4,FALSE)))","v":0},null,{"$f":"IF($C17=\"\",0,IF($S17>VLOOKUP($C17,PREMISSAS!$C$6:$J$13,4,FALSE),$S17-VLOOKUP($C17,PREMISSAS!$C$6:$J$13,4,FALSE),0))","v":0},null,"JORNADA MENSAL",{"$f":"AB16*5","v":9.1666666666666661},null,null,"","","","","","",""]
[null,null,4,{"$f":"IF(D17=\"\",\"\",IF((D17+1)>'PERIODOS E FERIADOS'!$G$6,\"\",D17+1))","v":"2023-05-10"},"Quarta",null,null,null,null,null,null,null,0,null,0,null,null,null,0,null,null,null,{"$f":"IF($C18=\"\",0,IF($S18<=VLOOKUP($C18,PREMISSAS!$C$6:$J$13,4,FALSE),$S18,VLOOKUP($C18,PREMISSAS!$C$6:$J$13,4,FALSE)))","v":0},null,{"$f":"IF($C18=\"\",0,IF($S18>VLOOKUP($C18,PREMISSAS!$C$6:$J$13,4,FALSE),$S18-VLOOKUP($C18,PREMISSAS!$C$6:$J$13,4,FALSE),0))","v":0},null,null,null,null,null,"","","","","","",""]
[null,null,5,{"$f":"IF(D18=\"\",\"\",IF((D18+1)>'PERIODOS E FERIADOS'!$G$6,\"\",D18+1))","v":"2023-05-11"},"Quinta",null,null,null,null,null,null,null,0,null,0,null,null,null,0,null,null,null,{"$f":"IF($C19=\"\",0,IF($S19<=VLOOKUP($C19,PREMISSAS!$C$6:$J$13,4,FALSE),$S19,VLOOKUP($C19,PREMISSAS!$C$6:$J$13,4,FALSE)))","v":0},null,{"$f":"IF($C19=\"\",0,IF($S19>VLOOKUP($C19,PREMISSAS!$C$6:$J$13,4,FALSE),$S19-VLOOKUP($C19,PREMISSAS!$C$6:$J$13,4,FALSE),0))","v":0},null,{"$f":"IF(AB$16>AB$23,\"Jornada Superior a permitida\",IF(AB$16<=AB$23,\"\"))","v":""},null,null,null,"","","","","","",""]
[null,null,6,{"$f":"IF(D19=\"\",\"\",IF((D19+1)>'PERIODOS E FERIADOS'!$G$6,\"\",D19+1))","v":"2023-05-12"},"Sexta",null,null,null,null,null,null,null,0,null,0,null,null,null,0,null,null,null,{"$f":"IF($C20=\"\",0,IF($S20<=VLOOKUP($C20,PREMISSAS!$C$6:$J$13,4,FALSE),$S20,VLOOKUP($C20,PREMISSAS!$C$6:$J$13,4,FALSE)))","v":0},null,{"$f":"IF($C20=\"\",0,IF($S20>VLOOKUP($C20,PREMISSAS!$C$6:$J$13,4,FALSE),$S20-VLOOKUP($C20,PREMISSAS!$C$6:$J$13,4,FALSE),0))","v":0},null,{"$f":"IF(AB$16>AB$23,\"\",IF(AB$16<=AB$23,\"Jornada Ok\"))","v":"Jornada Ok"},null,null,null,"","","","","","",""]
[null,null,7,{"$f":"IF(D20=\"\",\"\",IF((D20+1)>'PERIODOS E FERIADOS'!$G$6,\"\",D20+1))","v":"2023-05-13"},"Sábado",null,null,null,null,null,null,null,0,null,0,null,null,null,0,null,null,null,{"$f":"IF($C21=\"\",0,IF($S21<=VLOOKUP($C21,PREMISSAS!$C$6:$J$13,4,FALSE),$S21,VLOOKUP($C21,PREMISSAS!$C$6:$J$13,4,FALSE)))","v":0},null,{"$f":"IF($C21=\"\",0,IF($S21>VLOOKUP($C21,PREMISSAS!$C$6:$J$13,4,FALSE),$S21-VLOOKUP($C21,PREMISSAS!$C$6:$J$13,4,FALSE),0))","v":0},null,null,null,null,null,"","","","","","",""]
[null,null,1,{"$f":"IF(D21=\"\",\"\",IF((D21+1)>'PERIODOS E FERIADOS'!$G$6,\"\",D21+1))","v":"2023-05-14"},"Domingo",null,null,null,null,null,null,null,0,null,0,null,null,null,0,null,null,null,{"$f":"IF($C22=\"\",0,IF($S22<=VLOOKUP($C22,PREMISSAS!$C$6:$J$13,4,FALSE),$S22,VLOOKUP($C22,PREMISSAS!$C$6:$J$13,4,FALSE)))","v":0},null,{"$f":"IF($C22=\"\",0,IF($S22>VLOOKUP($C22,PREMISSAS!$C$6:$J$13,4,FALSE),$S22-VLOOKUP($C22,PREMISSAS!$C$6:$J$13,4,FALSE),0))","v":0},null,null,null,null,null,"","","","","","",""]
[null,null,2,{"$f":"IF(D22=\"\",\"\",IF((D22+1)>'PERIODOS E FERIADOS'!$G$6,\"\",D22+1))","v":"2023-05-15"},"Segunda",null,null,null,null,null,null,null,0,null,0,null,null,null,0,null,null,null,{"$f":"IF($C23=\"\",0,IF($S23<=VLOOKUP($C23,PREMISSAS!$C$6:$J$13,4,FALSE),$S23,VLOOKUP($C23,PREMISSAS!$C$6:$J$13,4,FALSE)))","v":0},null,{"$f":"IF($C23=\"\",0,IF($S23>VLOOKUP($C23,PREMISSAS!$C$6:$J$13,4,FALSE),$S23-VLOOKUP($C23,PREMISSAS!$C$6:$J$13,4,FALSE),0))","v":0},null,"Jornada Maxima",1.8333333333333333,null,null,"","","","","","",""]
[null,null,3,{"$f":"IF(D23=\"\",\"\",IF((D23+1)>'PERIODOS E FERIADOS'!$G$6,\"\",D23+1))","v":"2023-05-16"},"Terça",null,null,null,null,null,null,null,0,null,0,null,null,null,0,null,null,null,{"$f":"IF($C24=\"\",0,IF($S24<=VLOOKUP($C24,PREMISSAS!$C$6:$J$13,4,FALSE),$S24,VLOOKUP($C24,PREMISSAS!$C$6:$J$13,4,FALSE)))","v":0},null,{"$f":"IF($C24=\"\",0,IF($S24>VLOOKUP($C24,PREMISSAS!$C$6:$J$13,4,FALSE),$S24-VLOOKUP($C24,PREMISSAS!$C$6:$J$13,4,FALSE),0))","v":0},null,null,null,null,null,"","","","","","",""]
[null,null,4,{"$f":"IF(D24=\"\",\"\",IF((D24+1)>'PERIODOS E FERIADOS'!$G$6,\"\",D24+1))","v":"2023-05-17"},"Quarta",null,null,null,null,null,null,null,0,null,0,null,null,null,0,null,null,null,{"$f":"IF($C25=\"\",0,IF($S25<=VLOOKUP($C25,PREMISSAS!$C$6:$J$13,4,FALSE),$S25,VLOOKUP($C25,PREMISSAS!$C$6:$J$13,4,FALSE)))","v":0},null,{"$f":"IF($C25=\"\",0,IF($S25>VLOOKUP($C25,PREMISSAS!$C$6:$J$13,4,FALSE),$S25-VLOOKUP($C25,PREMISSAS!$C$6:$J$13,4,FALSE),0))","v":0},null,null,null,null,null,"","","","","","",""]
[null,null,5,{"$f":"IF(D25=\"\",\"\",IF((D25+1)>'PERIODOS E FERIADOS'!$G$6,\"\",D25+1))","v":"2023-05-18"},"Quinta",null,null,null,null,null,null,null,0,null,0,null,null,null,0,null,null,null,{"$f":"IF($C26=\"\",0,IF($S26<=VLOOKUP($C26,PREMISSAS!$C$6:$J$13,4,FALSE),$S26,VLOOKUP($C26,PREMISSAS!$C$6:$J$13,4,FALSE)))","v":0},null,{"$f":"IF($C26=\"\",0,IF($S26>VLOOKUP($C26,PREMISSAS!$C$6:$J$13,4,FALSE),$S26-VLOOKUP($C26,PREMISSAS!$C$6:$J$13,4,FALSE),0))","v":0},null,null,null,null,null,"","","","","","",""]
[null,null,6,{"$f":"IF(D26=\"\",\"\",IF((D26+1)>'PERIODOS E FERIADOS'!$G$6,\"\",D26+1))","v":"2023-05-19"},"Sexta",null,null,null,null,null,null,null,0,null,0,null,null,null,0,null,null,null,{"$f":"IF($C27=\"\",0,IF($S27<=VLOOKUP($C27,PREMISSAS!$C$6:$J$13,4,FALSE),$S27,VLOOKUP($C27,PREMISSAS!$C$6:$J$13,4,FALSE)))","v":0},null,{"$f":"IF($C27=\"\",0,IF($S27>VLOOKUP($C27,PREMISSAS!$C$6:$J$13,4,FALSE),$S27-VLOOKUP($C27,PREMISSAS!$C$6:$J$13,4,FALSE),0))","v":0},null,null,null,null,null,"","","","","","",""]
[null,null,7,{"$f":"IF(D27=\"\",\"\",IF((D27+1)>'PERIODOS E FERIADOS'!$G$6,\"\",D27+1))","v":"2023-05-20"},"Sábado",null,null,null,null,null,null,null,0,null,0,null,null,null,0,null,null,null,{"$f":"IF($C28=\"\",0,IF($S28<=VLOOKUP($C28,PREMISSAS!$C$6:$J$13,4,FALSE),$S28,VLOOKUP($C28,PREMISSAS!$C$6:$J$13,4,FALSE)))","v":0},null,{"$f":"IF($C28=\"\",0,IF($S28>VLOOKUP($C28,PREMISSAS!$C$6:$J$13,4,FALSE),$S28-VLOOKUP($C28,PREMISSAS!$C$6:$J$13,4,FALSE),0))","v":0},null,null,null,null,null,"","","","","","",""]
[null,null,1,{"$f":"IF(D28=\"\",\"\",IF((D28+1)>'PERIODOS E FERIADOS'!$G$6,\"\",D28+1))","v":"2023-05-21"},"Domingo",null,null,null,null,null,null,null,0,null,0,null,null,null,0,null,null,null,{"$f":"IF($C29=\"\",0,IF($S29<=VLOOKUP($C29,PREMISSAS!$C$6:$J$13,4,FALSE),$S29,VLOOKUP($C29,PREMISSAS!$C$6:$J$13,4,FALSE)))","v":0},null,{"$f":"IF($C29=\"\",0,IF($S29>VLOOKUP($C29,PREMISSAS!$C$6:$J$13,4,FALSE),$S29-VLOOKUP($C29,PREMISSAS!$C$6:$J$13,4,FALSE),0))","v":0},null,null,null,null,null,"","","","","","",""]
[null,null,2,{"$f":"IF(D29=\"\",\"\",IF((D29+1)>'PERIODOS E FERIADOS'!$G$6,\"\",D29+1))","v":"2023-05-22"},"Segunda",null,null,null,null,null,null,null,0,null,0,null,null,null,0,null,null,null,{"$f":"IF($C30=\"\",0,IF($S30<=VLOOKUP($C30,PREMISSAS!$C$6:$J$13,4,FALSE),$S30,VLOOKUP($C30,PREMISSAS!$C$6:$J$13,4,FALSE)))","v":0},null,{"$f":"IF($C30=\"\",0,IF($S30>VLOOKUP($C30,PREMISSAS!$C$6:$J$13,4,FALSE),$S30-VLOOKUP($C30,PREMISSAS!$C$6:$J$13,4,FALSE),0))","v":0},null,null,null,null,null,"","","","","","",""]
[null,null,3,{"$f":"IF(D30=\"\",\"\",IF((D30+1)>'PERIODOS E FERIADOS'!$G$6,\"\",D30+1))","v":"2023-05-23"},"Terça",null,null,null,null,null,null,null,0,null,0,null,null,null,0,null,null,null,{"$f":"IF($C31=\"\",0,IF($S31<=VLOOKUP($C31,PREMISSAS!$C$6:$J$13,4,FALSE),$S31,VLOOKUP($C31,PREMISSAS!$C$6:$J$13,4,FALSE)))","v":0},null,{"$f":"IF($C31=\"\",0,IF($S31>VLOOKUP($C31,PREMISSAS!$C$6:$J$13,4,FALSE),$S31-VLOOKUP($C31,PREMISSAS!$C$6:$J$13,4,FALSE),0))","v":0},null,null,null,null,null,"","","","","","",""]
[null,null,4,{"$f":"IF(D31=\"\",\"\",IF((D31+1)>'PERIODOS E FERIADOS'!$G$6,\"\",D31+1))","v":"2023-05-24"},"Quarta",null,null,null,null,null,null,null,0,null,0,null,null,null,0,null,null,null,{"$f":"IF($C32=\"\",0,IF($S32<=VLOOKUP($C32,PREMISSAS!$C$6:$J$13,4,FALSE),$S32,VLOOKUP($C32,PREMISSAS!$C$6:$J$13,4,FALSE)))","v":0},null,{"$f":"IF($C32=\"\",0,IF($S32>VLOOKUP($C32,PREMISSAS!$C$6:$J$13,4,FALSE),$S32-VLOOKUP($C32,PREMISSAS!$C$6:$J$13,4,FALSE),0))","v":0},null,null,null,null,null,{"$f":"IF(OR(F32=\"\",F32=0,F32=\"FALTA\",F32=\"SUSPENSO\",F32=\"SUSPENSÃO\"),\"\",TEXT(F32,\"##\"\":\"\"##\"))","v":""},{"$f":"IF(OR(G32=\"\",G32=0,G32=\"FALTA\",G32=\"SUSPENSO\",G32=\"SUSPENSÃO\"),\"\",TEXT(G32,\"##\"\":\"\"##\"))","v":""},"","",{"$f":"IF(OR(J32=\"\",J32=0,J32=\"FALTA\",J32=\"SUSPENSO\",J32=\"SUSPENSÃO\"),\"\",TEXT(J32,\"##\"\":\"\"##\"))","v":""},{"$f":"IF(OR(K32=\"\",K32=0,K32=\"FALTA\",K32=\"SUSPENSO\",K32=\"SUSPENSÃO\"),\"\",TEXT(K32,\"##\"\":\"\"##\"))","v":""},""]
[null,null,5,{"$f":"IF(D32=\"\",\"\",IF((D32+1)>'PERIODOS E FERIADOS'!$G$6,\"\",D32+1))","v":"2023-05-25"},"Quinta",null,null,null,null,null,null,null,0,null,0,null,null,null,0,null,null,null,{"$f":"IF($C33=\"\",0,IF($S33<=VLOOKUP($C33,PREMISSAS!$C$6:$J$13,4,FALSE),$S33,VLOOKUP($C33,PREMISSAS!$C$6:$J$13,4,FALSE)))","v":0},null,{"$f":"IF($C33=\"\",0,IF($S33>VLOOKUP($C33,PREMISSAS!$C$6:$J$13,4,FALSE),$S33-VLOOKUP($C33,PREMISSAS!$C$6:$J$13,4,FALSE),0))","v":0},null,null,null,null,null,{"$f":"IF(OR(F33=\"\",F33=0,F33=\"FALTA\",F33=\"SUSPENSO\",F33=\"SUSPENSÃO\"),\"\",TEXT(F33,\"##\"\":\"\"##\"))","v":""},"","","","","",""]
[null,null,6,{"$f":"IF(D33=\"\",\"\",IF((D33+1)>'PERIODOS E FERIADOS'!$G$6,\"\",D33+1))","v":"2023-05-26"},"Sexta",null,null,null,null,null,null,null,0,null,0,null,null,null,0,null,null,null,{"$f":"IF($C34=\"\",0,IF($S34<=VLOOKUP($C34,PREMISSAS!$C$6:$J$13,4,FALSE),$S34,VLOOKUP($C34,PREMISSAS!$C$6:$J$13,4,FALSE)))","v":0},null,{"$f":"IF($C34=\"\",0,IF($S34>VLOOKUP($C34,PREMISSAS!$C$6:$J$13,4,FALSE),$S34-VLOOKUP($C34,PREMISSAS!$C$6:$J$13,4,FALSE),0))","v":0},null,null,null,null,null,"","","","","","",""]
[null,null,7,{"$f":"IF(D34=\"\",\"\",IF((D34+1)>'PERIODOS E FERIADOS'!$G$6,\"\",D34+1))","v":"2023-05-27"},"Sábado",null,null,null,null,null,null,null,0,null,0,null,null,null,0,null,null,null,{"$f":"IF($C35=\"\",0,IF($S35<=VLOOKUP($C35,PREMISSAS!$C$6:$J$13,4,FALSE),$S35,VLOOKUP($C35,PREMISSAS!$C$6:$J$13,4,FALSE)))","v":0},null,{"$f":"IF($C35=\"\",0,IF($S35>VLOOKUP($C35,PREMISSAS!$C$6:$J$13,4,FALSE),$S35-VLOOKUP($C35,PREMISSAS!$C$6:$J$13,4,FALSE),0))","v":0},null,null,null,null,null,"","","","","","",""]
[null,null,1,{"$f":"IF(D35=\"\",\"\",IF((D35+1)>'PERIODOS E FERIADOS'!$G$6,\"\",D35+1))","v":"2023-05-28"},"Domingo",null,null,null,null,null,null,null,0,null,0,null,null,null,0,null,null,null,{"$f":"IF($C36=\"\",0,IF($S36<=VLOOKUP($C36,PREMISSAS!$C$6:$J$13,4,FALSE),$S36,VLOOKUP($C36,PREMISSAS!$C$6:$J$13,4,FALSE)))","v":0},null,{"$f":"IF($C36=\"\",0,IF($S36>VLOOKUP($C36,PREMISSAS!$C$6:$J$13,4,FALSE),$S36-VLOOKUP($C36,PREMISSAS!$C$6:$J$13,4,FALSE),0))","v":0},null,null,null,null,null,"","","","","","",""]
[null,null,2,{"$f":"IF(D36=\"\",\"\",IF((D36+1)>'PERIODOS E FERIADOS'!$G$6,\"\",D36+1))","v":"2023-05-29"},"Segunda",null,null,null,null,null,null,null,0,null,0,null,null,null,0,null,null,null,{"$f":"IF($C37=\"\",0,IF($S37<=VLOOKUP($C37,PREMISSAS!$C$6:$J$13,4,FALSE),$S37,VLOOKUP($C37,PREMISSAS!$C$6:$J$13,4,FALSE)))","v":0},null,{"$f":"IF($C37=\"\",0,IF($S37>VLOOKUP($C37,PREMISSAS!$C$6:$J$13,4,FALSE),$S37-VLOOKUP($C37,PREMISSAS!$C$6:$J$13,4,FALSE),0))","v":0},null,null,null,null,null,"","","","","","",""]
[null,null,3,{"$f":"IF(D37=\"\",\"\",IF((D37+1)>'PERIODOS E FERIADOS'!$G$6,\"\",D37+1))","v":"2023-05-30"},"Terça",null,null,null,null,null,null,null,0,null,0,null,null,null,0,null,null,null,{"$f":"IF($C38=\"\",0,IF($S38<=VLOOKUP($C38,PREMISSAS!$C$6:$J$13,4,FALSE),$S38,VLOOKUP($C38,PREMISSAS!$C$6:$J$13,4,FALSE)))","v":0},null,{"$f":"IF($C38=\"\",0,IF($S38>VLOOKUP($C38,PREMISSAS!$C$6:$J$13,4,FALSE),$S38-VLOOKUP($C38,PREMISSAS!$C$6:$J$13,4,FALSE),0))","v":0},null,null,null,null,null,"","","","","","",""]
[null,null,4,{"$f":"IF(D38=\"\",\"\",IF((D38+1)>'PERIODOS E FERIADOS'!$G$6,\"\",D38+1))","v":"2023-05-31"},"Quarta",null,null,null,null,null,null,null,0,null,0,null,null,null,0,null,null,null,{"$f":"IF($C39=\"\",0,IF($S39<=VLOOKUP($C39,PREMISSAS!$C$6:$J$13,4,FALSE),$S39,VLOOKUP($C39,PREMISSAS!$C$6:$J$13,4,FALSE)))","v":0},null,{"$f":"IF($C39=\"\",0,IF($S39>VLOOKUP($C39,PREMISSAS!$C$6:$J$13,4,FALSE),$S39-VLOOKUP($C39,PREMISSAS!$C$6:$J$13,4,FALSE),0))","v":0},null,null,null,null,null,"","","","","","",""]
[]
[null,null,null,"TOTAIS",null,null,"Faltas / Suspensão",null,{"$f":"COUNTIF($F$9:$F$39,\"FALTA\")+COUNTIF($F$9:$F$39,\"SUSPENSÃO\")+COUNTIF($F$9:$F$39,\"SUSPENSO\")+COUNTIF($F$9:$F$39,\"SUSPENSAO\")","v":0},null,null,null,{"$f":"SUM($M$9:$M$39)","v":0},null,{"$f":"SUM($O$9:$O$39)","v":0},null,null,null,{"$f":"SUM(S$9:S$39)","v":0},null,{"$f":"$AK$41","v":0},null,{"$f":"SUM(W$9:W$39)","v":0},null,{"$f":"SUM(Y$9:Y$39)","v":0},null,null,null,null,null,null,null,null,null,null,null,{"$f":"SUM(AK9:AK39)","v":0}]
[]
[null,null,null,"OBSERVAÇÕES:"]

{"sheet":"FUNC 12","index":16,"n_rows":43,"n_cols":37,"rows_kept":43,"cut":false,"hidden":false,"merged":[[5,30,5,33],[40,3,40,5],[40,6,40,7],[40,8,40,10],[42,3,43,24],[18,26,18,27],[19,26,19,27],[3,3,4,27],[5,3,5,4],[5,5,5,10],[5,12,5,20],[5,22,5,24],[5,26,5,27]]}
[]
[]
[]
[null,null,null,{"$f":"'PERIODOS E FERIADOS'!$E$5","v":0}]
[]
[null,null,null,"Funcionário",null,{"$f":"FUNCIONÁRIOS!E16","v":12},null,null,null,null,null,null,"H.E. / Atrasos / A.N",null,null,null,null,null,null,null,null,null,"Distrib. H.E. p/ Faixa",null,null,null,"CARGA HORÁRIA",null,null,null,"ESPELHO"]
[]
[null,null,null,"Data","Dia Semana","Entrada","Saída","Entrada","Saída","Entrada","Saída",null,"H. Diária",null,"Atrasos",null,"Abona",null,"Horas Extras",null,"Adc. Noturno",null,{"$f":"PREMISSAS!H6","v":0.5},null,{"$f":"PREMISSAS!H12","v":1},2,"SEGUNDA",0.33333333333333331,2,null,"Entrada","Saída","Entrada","Saída","Entrada","Saída","AN "]
[null,null,{"$f":"IF(NOT(ISERROR(VLOOKUP(D9,rngFeriados,1,FALSE))),\"F\",IF(D9=\"\",\"\",WEEKDAY($D9,1)))","v":"F"},{"$f":"'PERIODOS E FERIADOS'!$E$6","v":"2023-05-01"},{"$f":"IF(D9=\"\",\"\",IF(WEEKDAY(D9,1)=1,\"Domingo\",IF(WEEKDAY(D9,1)=2,\"Segunda\",IF(WEEKDAY(D9,1)=3,\"Terça\",IF(WEEKDAY(D9,1)=4,\"Quarta\",IF(WEEKDAY(D9,1)=5,\"Quinta\",IF(WEEKDAY(D9,1)=6,\"Sexta\",IF(WEEKDAY(D9,1)=7,\"Sábado\"))))))))","v":"Segunda"},null,null,null,null,null,null,null,{"$f":"IF(ISERROR(IF(OR($AF9=\"\",$AF9=0),0,(IF(TEXT($AF9,\"[hh]:mm:ss\")<TEXT($AE9,\"[hh]:mm:ss\"),(1-$AE9+$AF9),$AF9-$AE9))+IF(OR($AH9=\"\",$AH9=0),0,(IF(TEXT($AH9,\"[hh]:mm:ss\")<TEXT($AG9,\"[hh]:mm:ss\"),(1-$AG9+$AH9),$AH9-$AG9))+IF(OR($AJ9=\"\",$AJ9=0),0,(IF(TEXT($AJ9,\"[hh]:mm:ss\")<TEXT($AI9,\"[hh]:mm:ss\"),(1-$AI9+$AJ9),$AJ9-$AI9)))))),0,IF(OR($AF9=\"\",$AF9=0),0,(IF(TEXT($AF9,\"[hh]:mm:ss\")<TEXT($AE9,\"[hh]:mm:ss\"),(1-$AE9+$AF9),$AF9-$AE9))+IF(OR($AH9=\"\",$AH9=0),0,(IF(TEXT($AH9,\"[hh]:mm:ss\")<TEXT($AG9,\"[hh]:mm:ss\"),(1-$AG9+$AH9),$AH9-$AG9))+IF(OR($AJ9=\"\",$AJ9=0),0,(IF(TEXT($AJ9,\"[hh]:mm:ss\")<TEXT($AI9,\"[hh]:mm:ss\"),(1-$AI9+$AJ9),$AJ9-$AI9))))))","v":0},null,{"$f":"IF($C9=\"\",0,IF(Q9=\"Sim\",0,IF(TEXT(IF(OR((VLOOKUP($C9,$Z$8:$AB$15,3,FALSE)-$M9)<0,$AE9=\"\"),0,(VLOOKUP($C9,$Z$8:$AB$15,3,FALSE)-$M9)),\"[hh]:mm\")<=TEXT(rngTolerancia,\"[hh]:mm\"),0,IF(OR((VLOOKUP($C9,$Z$8:$AB$15,3,FALSE)-$M9)<0,$AE9=\"\"),0,(VLOOKUP($C9,$Z$8:$AB$15,3,FALSE)-$M9)))))","v":0},null,null,null,{"$f":"IF($C9=\"\",0,IF(TEXT(IF(($M9-VLOOKUP($C9,$Z$8:$AB$15,3,FALSE))<0,0,($M9-VLOOKUP($C9,$Z$8:$AB$15,3,FALSE))),\"[hh]:mm\")<=TEXT(rngTolerancia,\"[hh]:mm\"),0,IF(($M9-VLOOKUP($C9,$Z$8:$AB$15,3,FALSE))<0,0,($M9-VLOOKUP($C9,$Z$8:$AB$15,3,FALSE)))))","v":0},null,null,null,{"$f":"IF($C9=\"\",0,IF($S9<=VLOOKUP($C9,PREMISSAS!$C$6:$J$13,4,FALSE),$S9,VLOOKUP($C9,PREMISSAS!$C$6:$J$13,4,FALSE)))","v":0},null,{"$f":"IF($C9=\"\",0,IF($S9>VLOOKUP($C9,PREMISSAS!$C$6:$J$13,4,FALSE),$S9-VLOOKUP($C9,PREMISSAS!$C$6:$J$13,4,FALSE),0))","v":0},3,"TERÇA",0.33333333333333331,3,null,{"$f":"IF(OR(F9=\"\",F9=0,F9=\"FALTA\",F9=\"SUSPENSO\",F9=\"SUSPENSÃO\"),\"\",TEXT(F9,\"##\"\":\"\"##\"))","v":""},{"$f":"IF(OR(G9=\"\",G9=0,G9=\"FALTA\",G9=\"SUSPENSO\",G9=\"SUSPENSÃO\"),\"\",TEXT(G9,\"##\"\":\"\"##\"))","v":""},"","",{"$f":"IF(OR(J9=\"\",J9=0,J9=\"FALTA\",J9=\"SUSPENSO\",J9=\"SUSPENSÃO\"),\"\",TEXT(J9,\"##\"\":\"\"##\"))","v":""},{"$f":"IF(OR(K9=\"\",K9=0,K9=\"FALTA\",K9=\"SUSPENSO\",K9=\"SUSPENSÃO\"),\"\",TEXT(K9,\"##\"\":\"\"##\"))","v":""},{"$f":"IF(OR(U9=\"\",U9=0,U9=\"FALTA\",U9=\"SUSPENSO\",U9=\"SUSPENSÃO\"),\"\",TEXT(TEXT(U9,\"00\"\":\"\"00\"),\"[hh]:mm\")*1)","v":""}]
[null,null,3,{"$f":"IF(D9=\"\",\"\",IF((D9+1)>'PERIODOS E FERIADOS'!$G$6,\"\",D9+1))","v":"2023-05-02"},{"$f":"IF(D10=\"\",\"\",IF(WEEKDAY(D10,1)=1,\"Domingo\",IF(WEEKDAY(D10,1)=2,\"Segunda\",IF(WEEKDAY(D10,1)=3,\"Terça\",IF(WEEKDAY(D10,1)=4,\"Quarta\",IF(WEEKDAY(D10,1)=5,\"Quinta\",IF(WEEKDAY(D10,1)=6,\"Sexta\",IF(WEEKDAY(D10,1)=7,\"Sábado\"))))))))","v":"Terça"},null,null,null,null,null,null,null,{"$f":"IF(ISERROR(IF(OR($AF10=\"\",$AF10=0),0,(IF(TEXT($AF10,\"[hh]:mm:ss\")<TEXT($AE10,\"[hh]:mm:ss\"),(1-$AE10+$AF10),$AF10-$AE10))+IF(OR($AH10=\"\",$AH10=0),0,(IF(TEXT($AH10,\"[hh]:mm:ss\")<TEXT($AG10,\"[hh]:mm:ss\"),(1-$AG10+$AH10),$AH10-$AG10))+IF(OR($AJ10=\"\",$AJ10=0),0,(IF(TEXT($AJ10,\"[hh]:mm:ss\")<TEXT($AI10,\"[hh]:mm:ss\"),(1-$AI10+$AJ10),$AJ10-$AI10)))))),0,IF(OR($AF10=\"\",$AF10=0),0,(IF(TEXT($AF10,\"[hh]:mm:ss\")<TEXT($AE10,\"[hh]:mm:ss\"),(1-$AE10+$AF10),$AF10-$AE10))+IF(OR($AH10=\"\",$AH10=0),0,(IF(TEXT($AH10,\"[hh]:mm:ss\")<TEXT($AG10,\"[hh]:mm:ss\"),(1-$AG10+$AH10),$AH10-$AG10))+IF(OR($AJ10=\"\",$AJ10=0),0,(IF(TEXT($AJ10,\"[hh]:mm:ss\")<TEXT($AI10,\"[hh]:mm:ss\"),(1-$AI10+$AJ10),$AJ10-$AI10))))))","v":0},null,{"$f":"IF($C10=\"\",0,IF(Q10=\"Sim\",0,IF(TEXT(IF(OR((VLOOKUP($C10,$Z$8:$AB$15,3,FALSE)-$M10)<0,$AE10=\"\"),0,(VLOOKUP($C10,$Z$8:$AB$15,3,FALSE)-$M10)),\"[hh]:mm\")<=TEXT(rngTolerancia,\"[hh]:mm\"),0,IF(OR((VLOOKUP($C10,$Z$8:$AB$15,3,FALSE)-$M10)<0,$AE10=\"\"),0,(VLOOKUP($C10,$Z$8:$AB$15,3,FALSE)-$M10)))))","v":0},null,null,null,0,null,null,null,{"$f":"IF($C10=\"\",0,IF($S10<=VLOOKUP($C10,PREMISSAS!$C$6:$J$13,4,FALSE),$S10,VLOOKUP($C10,PREMISSAS!$C$6:$J$13,4,FALSE)))","v":0},null,{"$f":"IF($C10=\"\",0,IF($S10>VLOOKUP($C10,PREMISSAS!$C$6:$J$13,4,FALSE),$S10-VLOOKUP($C10,PREMISSAS!$C$6:$J$13,4,FALSE),0))","v":0},4,"QUARTA",0.33333333333333331,4,null,{"$f":"IF(OR(F10=\"\",F10=0,F10=\"FALTA\",F10=\"SUSPENSO\",F10=\"SUSPENSÃO\"),\"\",TEXT(F10,\"##\"\":\"\"##\"))","v":""},"","","","","",{"$f":"IF(OR(U10=\"\",U10=0,U10=\"FALTA\",U10=\"SUSPENSO\",U10=\"SUSPENSÃO\"),\"\",TEXT(TEXT(U10,\"00\"\":\"\"00\"),\"[hh]:mm\")*1)","v":""}]
[null,null,4,{"$f":"IF(D10=\"\",\"\",IF((D10+1)>'PERIODOS E FERIADOS'!$G$6,\"\",D10+1))","v":"2023-05-03"},"Quarta",null,null,null,null,null,null,null,0,null,0,null,null,null,0,null,null,null,{"$f":"IF($C11=\"\",0,IF($S11<=VLOOKUP($C11,PREMISSAS!$C$6:$J$13,4,FALSE),$S11,VLOOKUP($C11,PREMISSAS!$C$6:$J$13,4,FALSE)))","v":0},null,{"$f":"IF($C11=\"\",0,IF($S11>VLOOKUP($C11,PREMISSAS!$C$6:$J$13,4,FALSE),$S11-VLOOKUP($C11,PREMISSAS!$C$6:$J$13,4,FALSE),0))","v":0},5,"QUINTA",0.33333333333333331,5,null,"","","","","","",""]
[null,null,5,{"$f":"IF(D11=\"\",\"\",IF((D11+1)>'PERIODOS E FERIADOS'!$G$6,\"\",D11+1))","v":"2023-05-04"},"Quinta",null,null,null,null,null,null,null,0,null,0,null,null,null,0,null,null,null,{"$f":"IF($C12=\"\",0,IF($S12<=VLOOKUP($C12,PREMISSAS!$C$6:$J$13,4,FALSE),$S12,VLOOKUP($C12,PREMISSAS!$C$6:$J$13,4,FALSE)))","v":0},null,{"$f":"IF($C12=\"\",0,IF($S12>VLOOKUP($C12,PREMISSAS!$C$6:$J$13,4,FALSE),$S12-VLOOKUP($C12,PREMISSAS!$C$6:$J$13,4,FALSE),0))","v":0},6,"SEXTA",0.33333333333333331,6,null,"","","","","","",{"$f":"IF(OR(U12=\"\",U12=0,U12=\"FALTA\",U12=\"SUSPENSO\",U12=\"SUSPENSÃO\"),\"\",TEXT(TEXT(U12,\"##\"\":\"\"##\"),\"[hh]:mm\")*1)","v":""}]
[null,null,6,{"$f":"IF(D12=\"\",\"\",IF((D12+1)>'PERIODOS E FERIADOS'!$G$6,\"\",D12+1))","v":"2023-05-05"},"Sexta",null,null,null,null,null,null,null,0,null,0,null,null,null,0,null,null,null,{"$f":"IF($C13=\"\",0,IF($S13<=VLOOKUP($C13,PREMISSAS!$C$6:$J$13,4,FALSE),$S13,VLOOKUP($C13,PREMISSAS!$C$6:$J$13,4,FALSE)))","v":0},null,{"$f":"IF($C13=\"\",0,IF($S13>VLOOKUP($C13,PREMISSAS!$C$6:$J$13,4,FALSE),$S13-VLOOKUP($C13,PREMISSAS!$C$6:$J$13,4,FALSE),0))","v":0},7,"SÁBADO",0.16666666666666666,7,null,"","","","","","",""]
[null,null,7,{"$f":"IF(D13=\"\",\"\",IF((D13+1)>'PERIODOS E FERIADOS'!$G$6,\"\",D13+1))","v":"2023-05-06"},"Sábado",null,null,null,null,null,null,null,0,null,0,null,null,null,0,null,null,null,{"$f":"IF($C14=\"\",0,IF($S14<=VLOOKUP($C14,PREMISSAS!$C$6:$J$13,4,FALSE),$S14,VLOOKUP($C14,PREMISSAS!$C$6:$J$13,4,FALSE)))","v":0},null,{"$f":"IF($C14=\"\",0,IF($S14>VLOOKUP($C14,PREMISSAS!$C$6:$J$13,4,FALSE),$S14-VLOOKUP($C14,PREMISSAS!$C$6:$J$13,4,FALSE),0))","v":0},1,"DOMINGO",0,1,null,"","","","","","",""]
[null,null,1,{"$f":"IF(D14=\"\",\"\",IF((D14+1)>'PERIODOS E FERIADOS'!$G$6,\"\",D14+1))","v":"2023-05-07"},"Domingo",null,null,null,null,null,null,null,0,null,0,null,null,null,0,null,null,null,{"$f":"IF($C15=\"\",0,IF($S15<=VLOOKUP($C15,PREMISSAS!$C$6:$J$13,4,FALSE),$S15,VLOOKUP($C15,PREMISSAS!$C$6:$J$13,4,FALSE)))","v":0},null,{"$f":"IF($C15=\"\",0,IF($S15>VLOOKUP($C15,PREMISSAS!$C$6:$J$13,4,FALSE),$S15-VLOOKUP($C15,PREMISSAS!$C$6:$J$13,4,FALSE),0))","v":0},"F","FERIADOS",0,"F",null,"","","","","","",""]
[null,null,2,{"$f":"IF(D15=\"\",\"\",IF((D15+1)>'PERIODOS E FERIADOS'!$G$6,\"\",D15+1))","v":"2023-05-08"},"Segunda",null,null,null,null,null,null,null,0,null,0,null,null,null,0,null,null,null,{"$f":"IF($C16=\"\",0,IF($S16<=VLOOKUP($C16,PREMISSAS!$C$6:$J$13,4,FALSE),$S16,VLOOKUP($C16,PREMISSAS!$C$6:$J$13,4,FALSE)))","v":0},null,{"$f":"IF($C16=\"\",0,IF($S16>VLOOKUP($C16,PREMISSAS!$C$6:$J$13,4,FALSE),$S16-VLOOKUP($C16,PREMISSAS!$C$6:$J$13,4,FALSE),0))","v":0},null,"TOTAL SEMANA",{"$f":"SUM(AB8:AB15)","v":1.8333333333333333},null,null,"","","","","","",""]
[null,null,3,{"$f":"IF(D16=\"\",\"\",IF((D16+1)>'PERIODOS E FERIADOS'!$G$6,\"\",D16+1))","v":"2023-05-09"},"Terça",null,null,null,null,null,null,null,0,null,0,null,null,null,0,null,null,null,{"$f":"IF($C17=\"\",0,IF($S17<=VLOOKUP($C17,PREMISSAS!$C$6:$J$13,4,FALSE),$S17,VLOOKUP($C17,PREMISSAS!$C$6:$J$13,4,FALSE)))","v":0},null,{"$f":"IF($C17=\"\",0,IF($S17>VLOOKUP($C17,PREMISSAS!$C$6:$J$13,4,FALSE),$S17-VLOOKUP($C17,PREMISSAS!$C$6:$J$13,4,FALSE),0))","v":0},null,"JORNADA MENSAL",{"$f":"AB16*5","v":9.1666666666666661},null,null,"","","","","","",""]
[null,null,4,{"$f":"IF(D17=\"\",\"\",IF((D17+1)>'PERIODOS E FERIADOS'!$G$6,\"\",D17+1))","v":"2023-05-10"},"Quarta",null,null,null,null,null,null,null,0,null,0,null,null,null,0,null,null,null,{"$f":"IF($C18=\"\",0,IF($S18<=VLOOKUP($C18,PREMISSAS!$C$6:$J$13,4,FALSE),$S18,VLOOKUP($C18,PREMISSAS!$C$6:$J$13,4,FALSE)))","v":0},null,{"$f":"IF($C18=\"\",0,IF($S18>VLOOKUP($C18,PREMISSAS!$C$6:$J$13,4,FALSE),$S18-VLOOKUP($C18,PREMISSAS!$C$6:$J$13,4,FALSE),0))","v":0},null,null,null,null,null,"","","","","","",""]
[null,null,5,{"$f":"IF(D18=\"\",\"\",IF((D18+1)>'PERIODOS E FERIADOS'!$G$6,\"\",D18+1))","v":"2023-05-11"},"Quinta",null,null,null,null,null,null,null,0,null,0,null,null,null,0,null,null,null,{"$f":"IF($C19=\"\",0,IF($S19<=VLOOKUP($C19,PREMISSAS!$C$6:$J$13,4,FALSE),$S19,VLOOKUP($C19,PREMISSAS!$C$6:$J$13,4,FALSE)))","v":0},null,{"$f":"IF($C19=\"\",0,IF($S19>VLOOKUP($C19,PREMISSAS!$C$6:$J$13,4,FALSE),$S19-VLOOKUP($C19,PREMISSAS!$C$6:$J$13,4,FALSE),0))","v":0},null,{"$f":"IF(AB$16>AB$23,\"Jornada Superior a permitida\",IF(AB$16<=AB$23,\"\"))","v":""},null,null,null,"","","","","","",""]
[null,null,6,{"$f":"IF(D19=\"\",\"\",IF((D19+1)>'PERIODOS E FERIADOS'!$G$6,\"\",D19+1))","v":"2023-05-12"},"Sexta",null,null,null,null,null,null,null,0,null,0,null,null,null,0,null,null,null,{"$f":"IF($C20=\"\",0,IF($S20<=VLOOKUP($C20,PREMISSAS!$C$6:$J$13,4,FALSE),$S20,VLOOKUP($C20,PREMISSAS!$C$6:$J$13,4,FALSE)))","v":0},null,{"$f":"IF($C20=\"\",0,IF($S20>VLOOKUP($C20,PREMISSAS!$C$6:$J$13,4,FALSE),$S20-VLOOKUP($C20,PREMISSAS!$C$6:$J$13,4,FALSE),0))","v":0},null,{"$f":"IF(AB$16>AB$23,\"\",IF(AB$16<=AB$23,\"Jornada Ok\"))","v":"Jornada Ok"},null,null,null,"","","","","","",""]
[null,null,7,{"$f":"IF(D20=\"\",\"\",IF((D20+1)>'PERIODOS E FERIADOS'!$G$6,\"\",D20+1))","v":"2023-05-13"},"Sábado",null,null,null,null,null,null,null,0,null,0,null,null,null,0,null,null,null,{"$f":"IF($C21=\"\",0,IF($S21<=VLOOKUP($C21,PREMISSAS!$C$6:$J$13,4,FALSE),$S21,VLOOKUP($C21,PREMISSAS!$C$6:$J$13,4,FALSE)))","v":0},null,{"$f":"IF($C21=\"\",0,IF($S21>VLOOKUP($C21,PREMISSAS!$C$6:$J$13,4,FALSE),$S21-VLOOKUP($C21,PREMISSAS!$C$6:$J$13,4,FALSE),0))","v":0},null,null,null,null,null,"","","","","","",""]
[null,null,1,{"$f":"IF(D21=\"\",\"\",IF((D21+1)>'PERIODOS E FERIADOS'!$G$6,\"\",D21+1))","v":"2023-05-14"},"Domingo",null,null,null,null,null,null,null,0,null,0,null,null,null,0,null,null,null,{"$f":"IF($C22=\"\",0,IF($S22<=VLOOKUP($C22,PREMISSAS!$C$6:$J$13,4,FALSE),$S22,VLOOKUP($C22,PREMISSAS!$C$6:$J$13,4,FALSE)))","v":0},null,{"$f":"IF($C22=\"\",0,IF($S22>VLOOKUP($C22,PREMISSAS!$C$6:$J$13,4,FALSE),$S22-VLOOKUP($C22,PREMISSAS!$C$6:$J$13,4,FALSE),0))","v":0},null,null,null,null,null,"","","","","","",""]
[null,null,2,{"$f":"IF(D22=\"\",\"\",IF((D22+1)>'PERIODOS E FERIADOS'!$G$6,\"\",D22+1))","v":"2023-05-15"},"Segunda",null,null,null,null,null,null,null,0,null,0,null,null,null,0,null,null,null,{"$f":"IF($C23=\"\",0,IF($S23<=VLOOKUP($C23,PREMISSAS!$C$6:$J$13,4,FALSE),$S23,VLOOKUP($C23,PREMISSAS!$C$6:$J$13,4,FALSE)))","v":0},null,{"$f":"IF($C23=\"\",0,IF($S23>VLOOKUP($C23,PREMISSAS!$C$6:$J$13,4,FALSE),$S23-VLOOKUP($C23,PREMISSAS!$C$6:$J$13,4,FALSE),0))","v":0},null,"Jornada Maxima",1.8333333333333333,null,null,"","","","","","",""]
[null,null,3,{"$f":"IF(D23=\"\",\"\",IF((D23+1)>'PERIODOS E FERIADOS'!$G$6,\"\",D23+1))","v":"2023-05-16"},"Terça",null,null,null,null,null,null,null,0,null,0,null,null,null,0,null,null,null,{"$f":"IF($C24=\"\",0,IF($S24<=VLOOKUP($C24,PREMISSAS!$C$6:$J$13,4,FALSE),$S24,VLOOKUP($C24,PREMISSAS!$C$6:$J$13,4,FALSE)))","v":0},null,{"$f":"IF($C24=\"\",0,IF($S24>VLOOKUP($C24,PREMISSAS!$C$6:$J$13,4,FALSE),$S24-VLOOKUP($C24,PREMISSAS!$C$6:$J$13,4,FALSE),0))","v":0},null,null,null,null,null,"","","","","","",""]
[null,null,4,{"$f":"IF(D24=\"\",\"\",IF((D24+1)>'PERIODOS E FERIADOS'!$G$6,\"\",D24+1))","v":"2023-05-17"},"Quarta",null,null,null,null,null,null,null,0,null,0,null,null,null,0,null,null,null,{"$f":"IF($C25=\"\",0,IF($S25<=VLOOKUP($C25,PREMISSAS!$C$6:$J$13,4,FALSE),$S25,VLOOKUP($C25,PREMISSAS!$C$6:$J$13,4,FALSE)))","v":0},null,{"$f":"IF($C25=\"\",0,IF($S25>VLOOKUP($C25,PREMISSAS!$C$6:$J$13,4,FALSE),$S25-VLOOKUP($C25,PREMISSAS!$C$6:$J$13,4,FALSE),0))","v":0},null,null,null,null,null,"","","","","","",""]
[null,null,5,{"$f":"IF(D25=\"\",\"\",IF((D25+1)>'PERIODOS E FERIADOS'!$G$6,\"\",D25+1))","v":"2023-05-18"},"Quinta",null,null,null,null,null,null,null,0,null,0,null,null,null,0,null,null,null,{"$f":"IF($C26=\"\",0,IF($S26<=VLOOKUP($C26,PREMISSAS!$C$6:$J$13,4,FALSE),$S26,VLOOKUP($C26,PREMISSAS!$C$6:$J$13,4,FALSE)))","v":0},null,{"$f":"IF($C26=\"\",0,IF($S26>VLOOKUP($C26,PREMISSAS!$C$6:$J$13,4,FALSE),$S26-VLOOKUP($C26,PREMISSAS!$C$6:$J$13,4,FALSE),0))","v":0},null,null,null,null,null,"","","","","","",""]
[null,null,6,{"$f":"IF(D26=\"\",\"\",IF((D26+1)>'PERIODOS E FERIADOS'!$G$6,\"\",D26+1))","v":"2023-05-19"},"Sexta",null,null,null,null,null,null,null,0,null,0,null,null,null,0,null,null,null,{"$f":"IF($C27=\"\",0,IF($S27<=VLOOKUP($C27,PREMISSAS!$C$6:$J$13,4,FALSE),$S27,VLOOKUP($C27,PREMISSAS!$C$6:$J$13,4,FALSE)))","v":0},null,{"$f":"IF($C27=\"\",0,IF($S27>VLOOKUP($C27,PREMISSAS!$C$6:$J$13,4,FALSE),$S27-VLOOKUP($C27,PREMISSAS!$C$6:$J$13,4,FALSE),0))","v":0},null,null,null,null,null,"","","","","","",""]
[null,null,7,{"$f":"IF(D27=\"\",\"\",IF((D27+1)>'PERIODOS E FERIADOS'!$G$6,\"\",D27+1))","v":"2023-05-20"},"Sábado",null,null,null,null,null,null,null,0,null,0,null,null,null,0,null,null,null,{"$f":"IF($C28=\"\",0,IF($S28<=VLOOKUP($C28,PREMISSAS!$C$6:$J$13,4,FALSE),$S28,VLOOKUP($C28,PREMISSAS!$C$6:$J$13,4,FALSE)))","v":0},null,{"$f":"IF($C28=\"\",0,IF($S28>VLOOKUP($C28,PREMISSAS!$C$6:$J$13,4,FALSE),$S28-VLOOKUP($C28,PREMISSAS!$C$6:$J$13,4,FALSE),0))","v":0},null,null,null,null,null,"","","","","","",""]
[null,null,1,{"$f":"IF(D28=\"\",\"\",IF((D28+1)>'PERIODOS E FERIADOS'!$G$6,\"\",D28+1))","v":"2023-05-21"},"Domingo",null,null,null,null,null,null,null,0,null,0,null,null,null,0,null,null,null,{"$f":"IF($C29=\"\",0,IF($S29<=VLOOKUP($C29,PREMISSAS!$C$6:$J$13,4,FALSE),$S29,VLOOKUP($C29,PREMISSAS!$C$6:$J$13,4,FALSE)))","v":0},null,{"$f":"IF($C29=\"\",0,IF($S29>VLOOKUP($C29,PREMISSAS!$C$6:$J$13,4,FALSE),$S29-VLOOKUP($C29,PREMISSAS!$C$6:$J$13,4,FALSE),0))","v":0},null,null,null,null,null,"","","","","","",""]
[null,null,2,{"$f":"IF(D29=\"\",\"\",IF((D29+1)>'PERIODOS E FERIADOS'!$G$6,\"\",D29+1))","v":"2023-05-22"},"Segunda",null,null,null,null,null,null,null,0,null,0,null,null,null,0,null,null,null,{"$f":"IF($C30=\"\",0,IF($S30<=VLOOKUP($C30,PREMISSAS!$C$6:$J$13,4,FALSE),$S30,VLOOKUP($C30,PREMISSAS!$C$6:$J$13,4,FALSE)))","v":0},null,{"$f":"IF($C30=\"\",0,IF($S30>VLOOKUP($C30,PREMISSAS!$C$6:$J$13,4,FALSE),$S30-VLOOKUP($C30,PREMISSAS!$C$6:$J$13,4,FALSE),0))","v":0},null,null,null,null,null,"","","","","","",""]
[null,null,3,{"$f":"IF(D30=\"\",\"\",IF((D30+1)>'PERIODOS E FERIADOS'!$G$6,\"\",D30+1))","v":"2023-05-23"},"Terça",null,null,null,null,null,null,null,0,null,0,null,null,null,0,null,null,null,{"$f":"IF($C31=\"\",0,IF($S31<=VLOOKUP($C31,PREMISSAS!$C$6:$J$13,4,FALSE),$S31,VLOOKUP($C31,PREMISSAS!$C$6:$J$13,4,FALSE)))","v":0},null,{"$f":"IF($C31=\"\",0,IF($S31>VLOOKUP($C31,PREMISSAS!$C$6:$J$13,4,FALSE),$S31-VLOOKUP($C31,PREMISSAS!$C$6:$J$13,4,FALSE),0))","v":0},null,null,null,null,null,"","","","","","",""]
[null,null,4,{"$f":"IF(D31=\"\",\"\",IF((D31+1)>'PERIODOS E FERIADOS'!$G$6,\"\",D31+1))","v":"2023-05-24"},"Quarta",null,null,null,null,null,null,null,0,null,0,null,null,null,0,null,null,null,{"$f":"IF($C32=\"\",0,IF($S32<=VLOOKUP($C32,PREMISSAS!$C$6:$J$13,4,FALSE),$S32,VLOOKUP($C32,PREMISSAS!$C$6:$J$13,4,FALSE)))","v":0},null,{"$f":"IF($C32=\"\",0,IF($S32>VLOOKUP($C32,PREMISSAS!$C$6:$J$13,4,FALSE),$S32-VLOOKUP($C32,PREMISSAS!$C$6:$J$13,4,FALSE),0))","v":0},null,null,null,null,null,{"$f":"IF(OR(F32=\"\",F32=0,F32=\"FALTA\",F32=\"SUSPENSO\",F32=\"SUSPENSÃO\"),\"\",TEXT(F32,\"##\"\":\"\"##\"))","v":""},{"$f":"IF(OR(G32=\"\",G32=0,G32=\"FALTA\",G32=\"SUSPENSO\",G32=\"SUSPENSÃO\"),\"\",TEXT(G32,\"##\"\":\"\"##\"))","v":""},"","",{"$f":"IF(OR(J32=\"\",J32=0,J32=\"FALTA\",J32=\"SUSPENSO\",J32=\"SUSPENSÃO\"),\"\",TEXT(J32,\"##\"\":\"\"##\"))","v":""},{"$f":"IF(OR(K32=\"\",K32=0,K32=\"FALTA\",K32=\"SUSPENSO\",K32=\"SUSPENSÃO\"),\"\",TEXT(K32,\"##\"\":\"\"##\"))","v":""},""]
[null,null,5,{"$f":"IF(D32=\"\",\"\",IF((D32+1)>'PERIODOS E FERIADOS'!$G$6,\"\",D32+1))","v":"2023-05-25"},"Quinta",null,null,null,null,null,null,null,0,null,0,null,null,null,0,null,null,null,{"$f":"IF($C33=\"\",0,IF($S33<=VLOOKUP($C33,PREMISSAS!$C$6:$J$13,4,FALSE),$S33,VLOOKUP($C33,PREMISSAS!$C$6:$J$13,4,FALSE)))","v":0},null,{"$f":"IF($C33=\"\",0,IF($S33>VLOOKUP($C33,PREMISSAS!$C$6:$J$13,4,FALSE),$S33-VLOOKUP($C33,PREMISSAS!$C$6:$J$13,4,FALSE),0))","v":0},null,null,null,null,null,{"$f":"IF(OR(F33=\"\",F33=0,F33=\"FALTA\",F33=\"SUSPENSO\",F33=\"SUSPENSÃO\"),\"\",TEXT(F33,\"##\"\":\"\"##\"))","v":""},"","","","","",""]
[null,null,6,{"$f":"IF(D33=\"\",\"\",IF((D33+1)>'PERIODOS E FERIADOS'!$G$6,\"\",D33+1))","v":"2023-05-26"},"Sexta",null,null,null,null,null,null,null,0,null,0,null,null,null,0,null,null,null,{"$f":"IF($C34=\"\",0,IF($S34<=VLOOKUP($C34,PREMISSAS!$C$6:$J$13,4,FALSE),$S34,VLOOKUP($C34,PREMISSAS!$C$6:$J$13,4,FALSE)))","v":0},null,{"$f":"IF($C34=\"\",0,IF($S34>VLOOKUP($C34,PREMISSAS!$C$6:$J$13,4,FALSE),$S34-VLOOKUP($C34,PREMISSAS!$C$6:$J$13,4,FALSE),0))","v":0},null,null,null,null,null,"","","","","","",""]
[null,null,7,{"$f":"IF(D34=\"\",\"\",IF((D34+1)>'PERIODOS E FERIADOS'!$G$6,\"\",D34+1))","v":"2023-05-27"},"Sábado",null,null,null,null,null,null,null,0,null,0,null,null,null,0,null,null,null,{"$f":"IF($C35=\"\",0,IF($S35<=VLOOKUP($C35,PREMISSAS!$C$6:$J$13,4,FALSE),$S35,VLOOKUP($C35,PREMISSAS!$C$6:$J$13,4,FALSE)))","v":0},null,{"$f":"IF($C35=\"\",0,IF($S35>VLOOKUP($C35,PREMISSAS!$C$6:$J$13,4,FALSE),$S35-VLOOKUP($C35,PREMISSAS!$C$6:$J$13,4,FALSE),0))","v":0},null,null,null,null,null,"","","","","","",""]
[null,null,1,{"$f":"IF(D35=\"\",\"\",IF((D35+1)>'PERIODOS E FERIADOS'!$G$6,\"\",D35+1))","v":"2023-05-28"},"Domingo",null,null,null,null,null,null,null,0,null,0,null,null,null,0,null,null,null,{"$f":"IF($C36=\"\",0,IF($S36<=VLOOKUP($C36,PREMISSAS!$C$6:$J$13,4,FALSE),$S36,VLOOKUP($C36,PREMISSAS!$C$6:$J$13,4,FALSE)))","v":0},null,{"$f":"IF($C36=\"\",0,IF($S36>VLOOKUP($C36,PREMISSAS!$C$6:$J$13,4,FALSE),$S36-VLOOKUP($C36,PREMISSAS!$C$6:$J$13,4,FALSE),0))","v":0},null,null,null,null,null,"","","","","","",""]
[null,null,2,{"$f":"IF(D36=\"\",\"\",IF((D36+1)>'PERIODOS E FERIADOS'!$G$6,\"\",D36+1))","v":"2023-05-29"},"Segunda",null,null,null,null,null,null,null,0,null,0,null,null,null,0,null,null,null,{"$f":"IF($C37=\"\",0,IF($S37<=VLOOKUP($C37,PREMISSAS!$C$6:$J$13,4,FALSE),$S37,VLOOKUP($C37,PREMISSAS!$C$6:$J$13,4,FALSE)))","v":0},null,{"$f":"IF($C37=\"\",0,IF($S37>VLOOKUP($C37,PREMISSAS!$C$6:$J$13,4,FALSE),$S37-VLOOKUP($C37,PREMISSAS!$C$6:$J$13,4,FALSE),0))","v":0},null,null,null,null,null,"","","","","","",""]
[null,null,3,{"$f":"IF(D37=\"\",\"\",IF((D37+1)>'PERIODOS E FERIADOS'!$G$6,\"\",D37+1))","v":"2023-05-30"},"Terça",null,null,null,null,null,null,null,0,null,0,null,null,null,0,null,null,null,{"$f":"IF($C38=\"\",0,IF($S38<=VLOOKUP($C38,PREMISSAS!$C$6:$J$13,4,FALSE),$S38,VLOOKUP($C38,PREMISSAS!$C$6:$J$13,4,FALSE)))","v":0},null,{"$f":"IF($C38=\"\",0,IF($S38>VLOOKUP($C38,PREMISSAS!$C$6:$J$13,4,FALSE),$S38-VLOOKUP($C38,PREMISSAS!$C$6:$J$13,4,FALSE),0))","v":0},null,null,null,null,null,"","","","","","",""]
[null,null,4,{"$f":"IF(D38=\"\",\"\",IF((D38+1)>'PERIODOS E FERIADOS'!$G$6,\"\",D38+1))","v":"2023-05-31"},"Quarta",null,null,null,null,null,null,null,0,null,0,null,null,null,0,null,null,null,{"$f":"IF($C39=\"\",0,IF($S39<=VLOOKUP($C39,PREMISSAS!$C$6:$J$13,4,FALSE),$S39,VLOOKUP($C39,PREMISSAS!$C$6:$J$13,4,FALSE)))","v":0},null,{"$f":"IF($C39=\"\",0,IF($S39>VLOOKUP($C39,PREMISSAS!$C$6:$J$13,4,FALSE),$S39-VLOOKUP($C39,PREMISSAS!$C$6:$J$13,4,FALSE),0))","v":0},null,null,null,null,null,"","","","","","",""]
[]
[null,null,null,"TOTAIS",null,null,"Faltas / Suspensão",null,{"$f":"COUNTIF($F$9:$F$39,\"FALTA\")+COUNTIF($F$9:$F$39,\"SUSPENSÃO\")+COUNTIF($F$9:$F$39,\"SUSPENSO\")+COUNTIF($F$9:$F$39,\"SUSPENSAO\")","v":0},null,null,null,{"$f":"SUM($M$9:$M$39)","v":0},null,{"$f":"SUM($O$9:$O$39)","v":0},null,null,null,{"$f":"SUM(S$9:S$39)","v":0},null,{"$f":"$AK$41","v":0},null,{"$f":"SUM(W$9:W$39)","v":0},null,{"$f":"SUM(Y$9:Y$39)","v":0},null,null,null,null,null,null,null,null,null,null,null,{"$f":"SUM(AK9:AK39)","v":0}]
[]
[null,null,null,"OBSERVAÇÕES:"]

{"sheet":"FUNC 13","index":17,"n_rows":43,"n_cols":37,"rows_kept":43,"cut":false,"hidden":false,"merged":[[5,30,5,33],[40,3,40,5],[40,6,40,7],[40,8,40,10],[42,3,43,24],[18,26,18,27],[19,26,19,27],[3,3,4,27],[5,3,5,4],[5,5,5,10],[5,12,5,20],[5,22,5,24],[5,26,5,27]]}
[]
[]
[]
[null,null,null,{"$f":"'PERIODOS E FERIADOS'!$E$5","v":0}]
[]
[null,null,null,"Funcionário",null,{"$f":"FUNCIONÁRIOS!E17","v":13},null,null,null,null,null,null,"H.E. / Atrasos / A.N",null,null,null,null,null,null,null,null,null,"Distrib. H.E. p/ Faixa",null,null,null,"CARGA HORÁRIA",null,null,null,"ESPELHO"]
[]
[null,null,null,"Data","Dia Semana","Entrada","Saída","Entrada","Saída","Entrada","Saída",null,"H. Diária",null,"Atrasos",null,"Abona",null,"Horas Extras",null,"Adc. Noturno",null,{"$f":"PREMISSAS!H6","v":0.5},null,{"$f":"PREMISSAS!H12","v":1},2,"SEGUNDA",0.33333333333333331,2,null,"Entrada","Saída","Entrada","Saída","Entrada","Saída","AN "]
[null,null,{"$f":"IF(NOT(ISERROR(VLOOKUP(D9,rngFeriados,1,FALSE))),\"F\",IF(D9=\"\",\"\",WEEKDAY($D9,1)))","v":"F"},{"$f":"'PERIODOS E FERIADOS'!$E$6","v":"2023-05-01"},{"$f":"IF(D9=\"\",\"\",IF(WEEKDAY(D9,1)=1,\"Domingo\",IF(WEEKDAY(D9,1)=2,\"Segunda\",IF(WEEKDAY(D9,1)=3,\"Terça\",IF(WEEKDAY(D9,1)=4,\"Quarta\",IF(WEEKDAY(D9,1)=5,\"Quinta\",IF(WEEKDAY(D9,1)=6,\"Sexta\",IF(WEEKDAY(D9,1)=7,\"Sábado\"))))))))","v":"Segunda"},null,null,null,null,null,null,null,{"$f":"IF(ISERROR(IF(OR($AF9=\"\",$AF9=0),0,(IF(TEXT($AF9,\"[hh]:mm:ss\")<TEXT($AE9,\"[hh]:mm:ss\"),(1-$AE9+$AF9),$AF9-$AE9))+IF(OR($AH9=\"\",$AH9=0),0,(IF(TEXT($AH9,\"[hh]:mm:ss\")<TEXT($AG9,\"[hh]:mm:ss\"),(1-$AG9+$AH9),$AH9-$AG9))+IF(OR($AJ9=\"\",$AJ9=0),0,(IF(TEXT($AJ9,\"[hh]:mm:ss\")<TEXT($AI9,\"[hh]:mm:ss\"),(1-$AI9+$AJ9),$AJ9-$AI9)))))),0,IF(OR($AF9=\"\",$AF9=0),0,(IF(TEXT($AF9,\"[hh]:mm:ss\")<TEXT($AE9,\"[hh]:mm:ss\"),(1-$AE9+$AF9),$AF9-$AE9))+IF(OR($AH9=\"\",$AH9=0),0,(IF(TEXT($AH9,\"[hh]:mm:ss\")<TEXT($AG9,\"[hh]:mm:ss\"),(1-$AG9+$AH9),$AH9-$AG9))+IF(OR($AJ9=\"\",$AJ9=0),0,(IF(TEXT($AJ9,\"[hh]:mm:ss\")<TEXT($AI9,\"[hh]:mm:ss\"),(1-$AI9+$AJ9),$AJ9-$AI9))))))","v":0},null,{"$f":"IF($C9=\"\",0,IF(Q9=\"Sim\",0,IF(TEXT(IF(OR((VLOOKUP($C9,$Z$8:$AB$15,3,FALSE)-$M9)<0,$AE9=\"\"),0,(VLOOKUP($C9,$Z$8:$AB$15,3,FALSE)-$M9)),\"[hh]:mm\")<=TEXT(rngTolerancia,\"[hh]:mm\"),0,IF(OR((VLOOKUP($C9,$Z$8:$AB$15,3,FALSE)-$M9)<0,$AE9=\"\"),0,(VLOOKUP($C9,$Z$8:$AB$15,3,FALSE)-$M9)))))","v":0},null,null,null,{"$f":"IF($C9=\"\",0,IF(TEXT(IF(($M9-VLOOKUP($C9,$Z$8:$AB$15,3,FALSE))<0,0,($M9-VLOOKUP($C9,$Z$8:$AB$15,3,FALSE))),\"[hh]:mm\")<=TEXT(rngTolerancia,\"[hh]:mm\"),0,IF(($M9-VLOOKUP($C9,$Z$8:$AB$15,3,FALSE))<0,0,($M9-VLOOKUP($C9,$Z$8:$AB$15,3,FALSE)))))","v":0},null,null,null,{"$f":"IF($C9=\"\",0,IF($S9<=VLOOKUP($C9,PREMISSAS!$C$6:$J$13,4,FALSE),$S9,VLOOKUP($C9,PREMISSAS!$C$6:$J$13,4,FALSE)))","v":0},null,{"$f":"IF($C9=\"\",0,IF($S9>VLOOKUP($C9,PREMISSAS!$C$6:$J$13,4,FALSE),$S9-VLOOKUP($C9,PREMISSAS!$C$6:$J$13,4,FALSE),0))","v":0},3,"TERÇA",0.33333333333333331,3,null,{"$f":"IF(OR(F9=\"\",F9=0,F9=\"FALTA\",F9=\"SUSPENSO\",F9=\"SUSPENSÃO\"),\"\",TEXT(F9,\"##\"\":\"\"##\"))","v":""},{"$f":"IF(OR(G9=\"\",G9=0,G9=\"FALTA\",G9=\"SUSPENSO\",G9=\"SUSPENSÃO\"),\"\",TEXT(G9,\"##\"\":\"\"##\"))","v":""},"","",{"$f":"IF(OR(J9=\"\",J9=0,J9=\"FALTA\",J9=\"SUSPENSO\",J9=\"SUSPENSÃO\"),\"\",TEXT(J9,\"##\"\":\"\"##\"))","v":""},{"$f":"IF(OR(K9=\"\",K9=0,K9=\"FALTA\",K9=\"SUSPENSO\",K9=\"SUSPENSÃO\"),\"\",TEXT(K9,\"##\"\":\"\"##\"))","v":""},{"$f":"IF(OR(U9=\"\",U9=0,U9=\"FALTA\",U9=\"SUSPENSO\",U9=\"SUSPENSÃO\"),\"\",TEXT(TEXT(U9,\"00\"\":\"\"00\"),\"[hh]:mm\")*1)","v":""}]
[null,null,3,{"$f":"IF(D9=\"\",\"\",IF((D9+1)>'PERIODOS E FERIADOS'!$G$6,\"\",D9+1))","v":"2023-05-02"},{"$f":"IF(D10=\"\",\"\",IF(WEEKDAY(D10,1)=1,\"Domingo\",IF(WEEKDAY(D10,1)=2,\"Segunda\",IF(WEEKDAY(D10,1)=3,\"Terça\",IF(WEEKDAY(D10,1)=4,\"Quarta\",IF(WEEKDAY(D10,1)=5,\"Quinta\",IF(WEEKDAY(D10,1)=6,\"Sexta\",IF(WEEKDAY(D10,1)=7,\"Sábado\"))))))))","v":"Terça"},null,null,null,null,null,null,null,{"$f":"IF(ISERROR(IF(OR($AF10=\"\",$AF10=0),0,(IF(TEXT($AF10,\"[hh]:mm:ss\")<TEXT($AE10,\"[hh]:mm:ss\"),(1-$AE10+$AF10),$AF10-$AE10))+IF(OR($AH10=\"\",$AH10=0),0,(IF(TEXT($AH10,\"[hh]:mm:ss\")<TEXT($AG10,\"[hh]:mm:ss\"),(1-$AG10+$AH10),$AH10-$AG10))+IF(OR($AJ10=\"\",$AJ10=0),0,(IF(TEXT($AJ10,\"[hh]:mm:ss\")<TEXT($AI10,\"[hh]:mm:ss\"),(1-$AI10+$AJ10),$AJ10-$AI10)))))),0,IF(OR($AF10=\"\",$AF10=0),0,(IF(TEXT($AF10,\"[hh]:mm:ss\")<TEXT($AE10,\"[hh]:mm:ss\"),(1-$AE10+$AF10),$AF10-$AE10))+IF(OR($AH10=\"\",$AH10=0),0,(IF(TEXT($AH10,\"[hh]:mm:ss\")<TEXT($AG10,\"[hh]:mm:ss\"),(1-$AG10+$AH10),$AH10-$AG10))+IF(OR($AJ10=\"\",$AJ10=0),0,(IF(TEXT($AJ10,\"[hh]:mm:ss\")<TEXT($AI10,\"[hh]:mm:ss\"),(1-$AI10+$AJ10),$AJ10-$AI10))))))","v":0},null,{"$f":"IF($C10=\"\",0,IF(Q10=\"Sim\",0,IF(TEXT(IF(OR((VLOOKUP($C10,$Z$8:$AB$15,3,FALSE)-$M10)<0,$AE10=\"\"),0,(VLOOKUP($C10,$Z$8:$AB$15,3,FALSE)-$M10)),\"[hh]:mm\")<=TEXT(rngTolerancia,\"[hh]:mm\"),0,IF(OR((VLOOKUP($C10,$Z$8:$AB$15,3,FALSE)-$M10)<0,$AE10=\"\"),0,(VLOOKUP($C10,$Z$8:$AB$15,3,FALSE)-$M10)))))","v":0},null,null,null,0,null,null,null,{"$f":"IF($C10=\"\",0,IF($S10<=VLOOKUP($C10,PREMISSAS!$C$6:$J$13,4,FALSE),$S10,VLOOKUP($C10,PREMISSAS!$C$6:$J$13,4,FALSE)))","v":0},null,{"$f":"IF($C10=\"\",0,IF($S10>VLOOKUP($C10,PREMISSAS!$C$6:$J$13,4,FALSE),$S10-VLOOKUP($C10,PREMISSAS!$C$6:$J$13,4,FALSE),0))","v":0},4,"QUARTA",0.33333333333333331,4,null,{"$f":"IF(OR(F10=\"\",F10=0,F10=\"FALTA\",F10=\"SUSPENSO\",F10=\"SUSPENSÃO\"),\"\",TEXT(F10,\"##\"\":\"\"##\"))","v":""},"","","","","",{"$f":"IF(OR(U10=\"\",U10=0,U10=\"FALTA\",U10=\"SUSPENSO\",U10=\"SUSPENSÃO\"),\"\",TEXT(TEXT(U10,\"00\"\":\"\"00\"),\"[hh]:mm\")*1)","v":""}]
[null,null,4,{"$f":"IF(D10=\"\",\"\",IF((D10+1)>'PERIODOS E FERIADOS'!$G$6,\"\",D10+1))","v":"2023-05-03"},"Quarta",null,null,null,null,null,null,null,0,null,0,null,null,null,0,null,null,null,{"$f":"IF($C11=\"\",0,IF($S11<=VLOOKUP($C11,PREMISSAS!$C$6:$J$13,4,FALSE),$S11,VLOOKUP($C11,PREMISSAS!$C$6:$J$13,4,FALSE)))","v":0},null,{"$f":"IF($C11=\"\",0,IF($S11>VLOOKUP($C11,PREMISSAS!$C$6:$J$13,4,FALSE),$S11-VLOOKUP($C11,PREMISSAS!$C$6:$J$13,4,FALSE),0))","v":0},5,"QUINTA",0.33333333333333331,5,null,"","","","","","",""]
[null,null,5,{"$f":"IF(D11=\"\",\"\",IF((D11+1)>'PERIODOS E FERIADOS'!$G$6,\"\",D11+1))","v":"2023-05-04"},"Quinta",null,null,null,null,null,null,null,0,null,0,null,null,null,0,null,null,null,{"$f":"IF($C12=\"\",0,IF($S12<=VLOOKUP($C12,PREMISSAS!$C$6:$J$13,4,FALSE),$S12,VLOOKUP($C12,PREMISSAS!$C$6:$J$13,4,FALSE)))","v":0},null,{"$f":"IF($C12=\"\",0,IF($S12>VLOOKUP($C12,PREMISSAS!$C$6:$J$13,4,FALSE),$S12-VLOOKUP($C12,PREMISSAS!$C$6:$J$13,4,FALSE),0))","v":0},6,"SEXTA",0.33333333333333331,6,null,"","","","","","",{"$f":"IF(OR(U12=\"\",U12=0,U12=\"FALTA\",U12=\"SUSPENSO\",U12=\"SUSPENSÃO\"),\"\",TEXT(TEXT(U12,\"##\"\":\"\"##\"),\"[hh]:mm\")*1)","v":""}]
[null,null,6,{"$f":"IF(D12=\"\",\"\",IF((D12+1)>'PERIODOS E FERIADOS'!$G$6,\"\",D12+1))","v":"2023-05-05"},"Sexta",null,null,null,null,null,null,null,0,null,0,null,null,null,0,null,null,null,{"$f":"IF($C13=\"\",0,IF($S13<=VLOOKUP($C13,PREMISSAS!$C$6:$J$13,4,FALSE),$S13,VLOOKUP($C13,PREMISSAS!$C$6:$J$13,4,FALSE)))","v":0},null,{"$f":"IF($C13=\"\",0,IF($S13>VLOOKUP($C13,PREMISSAS!$C$6:$J$13,4,FALSE),$S13-VLOOKUP($C13,PREMISSAS!$C$6:$J$13,4,FALSE),0))","v":0},7,"SÁBADO",0.16666666666666666,7,null,"","","","","","",""]
[null,null,7,{"$f":"IF(D13=\"\",\"\",IF((D13+1)>'PERIODOS E FERIADOS'!$G$6,\"\",D13+1))","v":"2023-05-06"},"Sábado",null,null,null,null,null,null,null,0,null,0,null,null,null,0,null,null,null,{"$f":"IF($C14=\"\",0,IF($S14<=VLOOKUP($C14,PREMISSAS!$C$6:$J$13,4,FALSE),$S14,VLOOKUP($C14,PREMISSAS!$C$6:$J$13,4,FALSE)))","v":0},null,{"$f":"IF($C14=\"\",0,IF($S14>VLOOKUP($C14,PREMISSAS!$C$6:$J$13,4,FALSE),$S14-VLOOKUP($C14,PREMISSAS!$C$6:$J$13,4,FALSE),0))","v":0},1,"DOMINGO",0,1,null,"","","","","","",""]
[null,null,1,{"$f":"IF(D14=\"\",\"\",IF((D14+1)>'PERIODOS E FERIADOS'!$G$6,\"\",D14+1))","v":"2023-05-07"},"Domingo",null,null,null,null,null,null,null,0,null,0,null,null,null,0,null,null,null,{"$f":"IF($C15=\"\",0,IF($S15<=VLOOKUP($C15,PREMISSAS!$C$6:$J$13,4,FALSE),$S15,VLOOKUP($C15,PREMISSAS!$C$6:$J$13,4,FALSE)))","v":0},null,{"$f":"IF($C15=\"\",0,IF($S15>VLOOKUP($C15,PREMISSAS!$C$6:$J$13,4,FALSE),$S15-VLOOKUP($C15,PREMISSAS!$C$6:$J$13,4,FALSE),0))","v":0},"F","FERIADOS",0,"F",null,"","","","","","",""]
[null,null,2,{"$f":"IF(D15=\"\",\"\",IF((D15+1)>'PERIODOS E FERIADOS'!$G$6,\"\",D15+1))","v":"2023-05-08"},"Segunda",null,null,null,null,null,null,null,0,null,0,null,null,null,0,null,null,null,{"$f":"IF($C16=\"\",0,IF($S16<=VLOOKUP($C16,PREMISSAS!$C$6:$J$13,4,FALSE),$S16,VLOOKUP($C16,PREMISSAS!$C$6:$J$13,4,FALSE)))","v":0},null,{"$f":"IF($C16=\"\",0,IF($S16>VLOOKUP($C16,PREMISSAS!$C$6:$J$13,4,FALSE),$S16-VLOOKUP($C16,PREMISSAS!$C$6:$J$13,4,FALSE),0))","v":0},null,"TOTAL SEMANA",{"$f":"SUM(AB8:AB15)","v":1.8333333333333333},null,null,"","","","","","",""]
[null,null,3,{"$f":"IF(D16=\"\",\"\",IF((D16+1)>'PERIODOS E FERIADOS'!$G$6,\"\",D16+1))","v":"2023-05-09"},"Terça",null,null,null,null,null,null,null,0,null,0,null,null,null,0,null,null,null,{"$f":"IF($C17=\"\",0,IF($S17<=VLOOKUP($C17,PREMISSAS!$C$6:$J$13,4,FALSE),$S17,VLOOKUP($C17,PREMISSAS!$C$6:$J$13,4,FALSE)))","v":0},null,{"$f":"IF($C17=\"\",0,IF($S17>VLOOKUP($C17,PREMISSAS!$C$6:$J$13,4,FALSE),$S17-VLOOKUP($C17,PREMISSAS!$C$6:$J$13,4,FALSE),0))","v":0},null,"JORNADA MENSAL",{"$f":"AB16*5","v":9.1666666666666661},null,null,"","","","","","",""]
[null,null,4,{"$f":"IF(D17=\"\",\"\",IF((D17+1)>'PERIODOS E FERIADOS'!$G$6,\"\",D17+1))","v":"2023-05-10"},"Quarta",null,null,null,null,null,null,null,0,null,0,null,null,null,0,null,null,null,{"$f":"IF($C18=\"\",0,IF($S18<=VLOOKUP($C18,PREMISSAS!$C$6:$J$13,4,FALSE),$S18,VLOOKUP($C18,PREMISSAS!$C$6:$J$13,4,FALSE)))","v":0},null,{"$f":"IF($C18=\"\",0,IF($S18>VLOOKUP($C18,PREMISSAS!$C$6:$J$13,4,FALSE),$S18-VLOOKUP($C18,PREMISSAS!$C$6:$J$13,4,FALSE),0))","v":0},null,null,null,null,null,"","","","","","",""]
[null,null,5,{"$f":"IF(D18=\"\",\"\",IF((D18+1)>'PERIODOS E FERIADOS'!$G$6,\"\",D18+1))","v":"2023-05-11"},"Quinta",null,null,null,null,null,null,null,0,null,0,null,null,null,0,null,null,null,{"$f":"IF($C19=\"\",0,IF($S19<=VLOOKUP($C19,PREMISSAS!$C$6:$J$13,4,FALSE),$S19,VLOOKUP($C19,PREMISSAS!$C$6:$J$13,4,FALSE)))","v":0},null,{"$f":"IF($C19=\"\",0,IF($S19>VLOOKUP($C19,PREMISSAS!$C$6:$J$13,4,FALSE),$S19-VLOOKUP($C19,PREMISSAS!$C$6:$J$13,4,FALSE),0))","v":0},null,{"$f":"IF(AB$16>AB$23,\"Jornada Superior a permitida\",IF(AB$16<=AB$23,\"\"))","v":""},null,null,null,"","","","","","",""]
[null,null,6,{"$f":"IF(D19=\"\",\"\",IF((D19+1)>'PERIODOS E FERIADOS'!$G$6,\"\",D19+1))","v":"2023-05-12"},"Sexta",null,null,null,null,null,null,null,0,null,0,null,null,null,0,null,null,null,{"$f":"IF($C20=\"\",0,IF($S20<=VLOOKUP($C20,PREMISSAS!$C$6:$J$13,4,FALSE),$S20,VLOOKUP($C20,PREMISSAS!$C$6:$J$13,4,FALSE)))","v":0},null,{"$f":"IF($C20=\"\",0,IF($S20>VLOOKUP($C20,PREMISSAS!$C$6:$J$13,4,FALSE),$S20-VLOOKUP($C20,PREMISSAS!$C$6:$J$13,4,FALSE),0))","v":0},null,{"$f":"IF(AB$16>AB$23,\"\",IF(AB$16<=AB$23,\"Jornada Ok\"))","v":"Jornada Ok"},null,null,null,"","","","","","",""]
[null,null,7,{"$f":"IF(D20=\"\",\"\",IF((D20+1)>'PERIODOS E FERIADOS'!$G$6,\"\",D20+1))","v":"2023-05-13"},"Sábado",null,null,null,null,null,null,null,0,null,0,null,null,null,0,null,null,null,{"$f":"IF($C21=\"\",0,IF($S21<=VLOOKUP($C21,PREMISSAS!$C$6:$J$13,4,FALSE),$S21,VLOOKUP($C21,PREMISSAS!$C$6:$J$13,4,FALSE)))","v":0},null,{"$f":"IF($C21=\"\",0,IF($S21>VLOOKUP($C21,PREMISSAS!$C$6:$J$13,4,FALSE),$S21-VLOOKUP($C21,PREMISSAS!$C$6:$J$13,4,FALSE),0))","v":0},null,null,null,null,null,"","","","","","",""]
[null,null,1,{"$f":"IF(D21=\"\",\"\",IF((D21+1)>'PERIODOS E FERIADOS'!$G$6,\"\",D21+1))","v":"2023-05-14"},"Domingo",null,null,null,null,null,null,null,0,null,0,null,null,null,0,null,null,null,{"$f":"IF($C22=\"\",0,IF($S22<=VLOOKUP($C22,PREMISSAS!$C$6:$J$13,4,FALSE),$S22,VLOOKUP($C22,PREMISSAS!$C$6:$J$13,4,FALSE)))","v":0},null,{"$f":"IF($C22=\"\",0,IF($S22>VLOOKUP($C22,PREMISSAS!$C$6:$J$13,4,FALSE),$S22-VLOOKUP($C22,PREMISSAS!$C$6:$J$13,4,FALSE),0))","v":0},null,null,null,null,null,"","","","","","",""]
[null,null,2,{"$f":"IF(D22=\"\",\"\",IF((D22+1)>'PERIODOS E FERIADOS'!$G$6,\"\",D22+1))","v":"2023-05-15"},"Segunda",null,null,null,null,null,null,null,0,null,0,null,null,null,0,null,null,null,{"$f":"IF($C23=\"\",0,IF($S23<=VLOOKUP($C23,PREMISSAS!$C$6:$J$13,4,FALSE),$S23,VLOOKUP($C23,PREMISSAS!$C$6:$J$13,4,FALSE)))","v":0},null,{"$f":"IF($C23=\"\",0,IF($S23>VLOOKUP($C23,PREMISSAS!$C$6:$J$13,4,FALSE),$S23-VLOOKUP($C23,PREMISSAS!$C$6:$J$13,4,FALSE),0))","v":0},null,"Jornada Maxima",1.8333333333333333,null,null,"","","","","","",""]
[null,null,3,{"$f":"IF(D23=\"\",\"\",IF((D23+1)>'PERIODOS E FERIADOS'!$G$6,\"\",D23+1))","v":"2023-05-16"},"Terça",null,null,null,null,null,null,null,0,null,0,null,null,null,0,null,null,null,{"$f":"IF($C24=\"\",0,IF($S24<=VLOOKUP($C24,PREMISSAS!$C$6:$J$13,4,FALSE),$S24,VLOOKUP($C24,PREMISSAS!$C$6:$J$13,4,FALSE)))","v":0},null,{"$f":"IF($C24=\"\",0,IF($S24>VLOOKUP($C24,PREMISSAS!$C$6:$J$13,4,FALSE),$S24-VLOOKUP($C24,PREMISSAS!$C$6:$J$13,4,FALSE),0))","v":0},null,null,null,null,null,"","","","","","",""]
[null,null,4,{"$f":"IF(D24=\"\",\"\",IF((D24+1)>'PERIODOS E FERIADOS'!$G$6,\"\",D24+1))","v":"2023-05-17"},"Quarta",null,null,null,null,null,null,null,0,null,0,null,null,null,0,null,null,null,{"$f":"IF($C25=\"\",0,IF($S25<=VLOOKUP($C25,PREMISSAS!$C$6:$J$13,4,FALSE),$S25,VLOOKUP($C25,PREMISSAS!$C$6:$J$13,4,FALSE)))","v":0},null,{"$f":"IF($C25=\"\",0,IF($S25>VLOOKUP($C25,PREMISSAS!$C$6:$J$13,4,FALSE),$S25-VLOOKUP($C25,PREMISSAS!$C$6:$J$13,4,FALSE),0))","v":0},null,null,null,null,null,"","","","","","",""]
[null,null,5,{"$f":"IF(D25=\"\",\"\",IF((D25+1)>'PERIODOS E FERIADOS'!$G$6,\"\",D25+1))","v":"2023-05-18"},"Quinta",null,null,null,null,null,null,null,0,null,0,null,null,null,0,null,null,null,{"$f":"IF($C26=\"\",0,IF($S26<=VLOOKUP($C26,PREMISSAS!$C$6:$J$13,4,FALSE),$S26,VLOOKUP($C26,PREMISSAS!$C$6:$J$13,4,FALSE)))","v":0},null,{"$f":"IF($C26=\"\",0,IF($S26>VLOOKUP($C26,PREMISSAS!$C$6:$J$13,4,FALSE),$S26-VLOOKUP($C26,PREMISSAS!$C$6:$J$13,4,FALSE),0))","v":0},null,null,null,null,null,"","","","","","",""]
[null,null,6,{"$f":"IF(D26=\"\",\"\",IF((D26+1)>'PERIODOS E FERIADOS'!$G$6,\"\",D26+1))","v":"2023-05-19"},"Sexta",null,null,null,null,null,null,null,0,null,0,null,null,null,0,null,null,null,{"$f":"IF($C27=\"\",0,IF($S27<=VLOOKUP($C27,PREMISSAS!$C$6:$J$13,4,FALSE),$S27,VLOOKUP($C27,PREMISSAS!$C$6:$J$13,4,FALSE)))","v":0},null,{"$f":"IF($C27=\"\",0,IF($S27>VLOOKUP($C27,PREMISSAS!$C$6:$J$13,4,FALSE),$S27-VLOOKUP($C27,PREMISSAS!$C$6:$J$13,4,FALSE),0))","v":0},null,null,null,null,null,"","","","","","",""]
[null,null,7,{"$f":"IF(D27=\"\",\"\",IF((D27+1)>'PERIODOS E FERIADOS'!$G$6,\"\",D27+1))","v":"2023-05-20"},"Sábado",null,null,null,null,null,null,null,0,null,0,null,null,null,0,null,null,null,{"$f":"IF($C28=\"\",0,IF($S28<=VLOOKUP($C28,PREMISSAS!$C$6:$J$13,4,FALSE),$S28,VLOOKUP($C28,PREMISSAS!$C$6:$J$13,4,FALSE)))","v":0},null,{"$f":"IF($C28=\"\",0,IF($S28>VLOOKUP($C28,PREMISSAS!$C$6:$J$13,4,FALSE),$S28-VLOOKUP($C28,PREMISSAS!$C$6:$J$13,4,FALSE),0))","v":0},null,null,null,null,null,"","","","","","",""]
[null,null,1,{"$f":"IF(D28=\"\",\"\",IF((D28+1)>'PERIODOS E FERIADOS'!$G$6,\"\",D28+1))","v":"2023-05-21"},"Domingo",null,null,null,null,null,null,null,0,null,0,null,null,null,0,null,null,null,{"$f":"IF($C29=\"\",0,IF($S29<=VLOOKUP($C29,PREMISSAS!$C$6:$J$13,4,FALSE),$S29,VLOOKUP($C29,PREMISSAS!$C$6:$J$13,4,FALSE)))","v":0},null,{"$f":"IF($C29=\"\",0,IF($S29>VLOOKUP($C29,PREMISSAS!$C$6:$J$13,4,FALSE),$S29-VLOOKUP($C29,PREMISSAS!$C$6:$J$13,4,FALSE),0))","v":0},null,null,null,null,null,"","","","","","",""]
[null,null,2,{"$f":"IF(D29=\"\",\"\",IF((D29+1)>'PERIODOS E FERIADOS'!$G$6,\"\",D29+1))","v":"2023-05-22"},"Segunda",null,null,null,null,null,null,null,0,null,0,null,null,null,0,null,null,null,{"$f":"IF($C30=\"\",0,IF($S30<=VLOOKUP($C30,PREMISSAS!$C$6:$J$13,4,FALSE),$S30,VLOOKUP($C30,PREMISSAS!$C$6:$J$13,4,FALSE)))","v":0},null,{"$f":"IF($C30=\"\",0,IF($S30>VLOOKUP($C30,PREMISSAS!$C$6:$J$13,4,FALSE),$S30-VLOOKUP($C30,PREMISSAS!$C$6:$J$13,4,FALSE),0))","v":0},null,null,null,null,null,"","","","","","",""]
[null,null,3,{"$f":"IF(D30=\"\",\"\",IF((D30+1)>'PERIODOS E FERIADOS'!$G$6,\"\",D30+1))","v":"2023-05-23"},"Terça",null,null,null,null,null,null,null,0,null,0,null,null,null,0,null,null,null,{"$f":"IF($C31=\"\",0,IF($S31<=VLOOKUP($C31,PREMISSAS!$C$6:$J$13,4,FALSE),$S31,VLOOKUP($C31,PREMISSAS!$C$6:$J$13,4,FALSE)))","v":0},null,{"$f":"IF($C31=\"\",0,IF($S31>VLOOKUP($C31,PREMISSAS!$C$6:$J$13,4,FALSE),$S31-VLOOKUP($C31,PREMISSAS!$C$6:$J$13,4,FALSE),0))","v":0},null,null,null,null,null,"","","","","","",""]
[null,null,4,{"$f":"IF(D31=\"\",\"\",IF((D31+1)>'PERIODOS E FERIADOS'!$G$6,\"\",D31+1))","v":"2023-05-24"},"Quarta",null,null,null,null,null,null,null,0,null,0,null,null,null,0,null,null,null,{"$f":"IF($C32=\"\",0,IF($S32<=VLOOKUP($C32,PREMISSAS!$C$6:$J$13,4,FALSE),$S32,VLOOKUP($C32,PREMISSAS!$C$6:$J$13,4,FALSE)))","v":0},null,{"$f":"IF($C32=\"\",0,IF($S32>VLOOKUP($C32,PREMISSAS!$C$6:$J$13,4,FALSE),$S32-VLOOKUP($C32,PREMISSAS!$C$6:$J$13,4,FALSE),0))","v":0},null,null,null,null,null,{"$f":"IF(OR(F32=\"\",F32=0,F32=\"FALTA\",F32=\"SUSPENSO\",F32=\"SUSPENSÃO\"),\"\",TEXT(F32,\"##\"\":\"\"##\"))","v":""},{"$f":"IF(OR(G32=\"\",G32=0,G32=\"FALTA\",G32=\"SUSPENSO\",G32=\"SUSPENSÃO\"),\"\",TEXT(G32,\"##\"\":\"\"##\"))","v":""},"","",{"$f":"IF(OR(J32=\"\",J32=0,J32=\"FALTA\",J32=\"SUSPENSO\",J32=\"SUSPENSÃO\"),\"\",TEXT(J32,\"##\"\":\"\"##\"))","v":""},{"$f":"IF(OR(K32=\"\",K32=0,K32=\"FALTA\",K32=\"SUSPENSO\",K32=\"SUSPENSÃO\"),\"\",TEXT(K32,\"##\"\":\"\"##\"))","v":""},""]
[null,null,5,{"$f":"IF(D32=\"\",\"\",IF((D32+1)>'PERIODOS E FERIADOS'!$G$6,\"\",D32+1))","v":"2023-05-25"},"Quinta",null,null,null,null,null,null,null,0,null,0,null,null,null,0,null,null,null,{"$f":"IF($C33=\"\",0,IF($S33<=VLOOKUP($C33,PREMISSAS!$C$6:$J$13,4,FALSE),$S33,VLOOKUP($C33,PREMISSAS!$C$6:$J$13,4,FALSE)))","v":0},null,{"$f":"IF($C33=\"\",0,IF($S33>VLOOKUP($C33,PREMISSAS!$C$6:$J$13,4,FALSE),$S33-VLOOKUP($C33,PREMISSAS!$C$6:$J$13,4,FALSE),0))","v":0},null,null,null,null,null,{"$f":"IF(OR(F33=\"\",F33=0,F33=\"FALTA\",F33=\"SUSPENSO\",F33=\"SUSPENSÃO\"),\"\",TEXT(F33,\"##\"\":\"\"##\"))","v":""},"","","","","",""]
[null,null,6,{"$f":"IF(D33=\"\",\"\",IF((D33+1)>'PERIODOS E FERIADOS'!$G$6,\"\",D33+1))","v":"2023-05-26"},"Sexta",null,null,null,null,null,null,null,0,null,0,null,null,null,0,null,null,null,{"$f":"IF($C34=\"\",0,IF($S34<=VLOOKUP($C34,PREMISSAS!$C$6:$J$13,4,FALSE),$S34,VLOOKUP($C34,PREMISSAS!$C$6:$J$13,4,FALSE)))","v":0},null,{"$f":"IF($C34=\"\",0,IF($S34>VLOOKUP($C34,PREMISSAS!$C$6:$J$13,4,FALSE),$S34-VLOOKUP($C34,PREMISSAS!$C$6:$J$13,4,FALSE),0))","v":0},null,null,null,null,null,"","","","","","",""]
[null,null,7,{"$f":"IF(D34=\"\",\"\",IF((D34+1)>'PERIODOS E FERIADOS'!$G$6,\"\",D34+1))","v":"2023-05-27"},"Sábado",null,null,null,null,null,null,null,0,null,0,null,null,null,0,null,null,null,{"$f":"IF($C35=\"\",0,IF($S35<=VLOOKUP($C35,PREMISSAS!$C$6:$J$13,4,FALSE),$S35,VLOOKUP($C35,PREMISSAS!$C$6:$J$13,4,FALSE)))","v":0},null,{"$f":"IF($C35=\"\",0,IF($S35>VLOOKUP($C35,PREMISSAS!$C$6:$J$13,4,FALSE),$S35-VLOOKUP($C35,PREMISSAS!$C$6:$J$13,4,FALSE),0))","v":0},null,null,null,null,null,"","","","","","",""]
[null,null,1,{"$f":"IF(D35=\"\",\"\",IF((D35+1)>'PERIODOS E FERIADOS'!$G$6,\"\",D35+1))","v":"2023-05-28"},"Domingo",null,null,null,null,null,null,null,0,null,0,null,null,null,0,null,null,null,{"$f":"IF($C36=\"\",0,IF($S36<=VLOOKUP($C36,PREMISSAS!$C$6:$J$13,4,FALSE),$S36,VLOOKUP($C36,PREMISSAS!$C$6:$J$13,4,FALSE)))","v":0},null,{"$f":"IF($C36=\"\",0,IF($S36>VLOOKUP($C36,PREMISSAS!$C$6:$J$13,4,FALSE),$S36-VLOOKUP($C36,PREMISSAS!$C$6:$J$13,4,FALSE),0))","v":0},null,null,null,null,null,"","","","","","",""]
[null,null,2,{"$f":"IF(D36=\"\",\"\",IF((D36+1)>'PERIODOS E FERIADOS'!$G$6,\"\",D36+1))","v":"2023-05-29"},"Segunda",null,null,null,null,null,null,null,0,null,0,null,null,null,0,null,null,null,{"$f":"IF($C37=\"\",0,IF($S37<=VLOOKUP($C37,PREMISSAS!$C$6:$J$13,4,FALSE),$S37,VLOOKUP($C37,PREMISSAS!$C$6:$J$13,4,FALSE)))","v":0},null,{"$f":"IF($C37=\"\",0,IF($S37>VLOOKUP($C37,PREMISSAS!$C$6:$J$13,4,FALSE),$S37-VLOOKUP($C37,PREMISSAS!$C$6:$J$13,4,FALSE),0))","v":0},null,null,null,null,null,"","","","","","",""]
[null,null,3,{"$f":"IF(D37=\"\",\"\",IF((D37+1)>'PERIODOS E FERIADOS'!$G$6,\"\",D37+1))","v":"2023-05-30"},"Terça",null,null,null,null,null,null,null,0,null,0,null,null,null,0,null,null,null,{"$f":"IF($C38=\"\",0,IF($S38<=VLOOKUP($C38,PREMISSAS!$C$6:$J$13,4,FALSE),$S38,VLOOKUP($C38,PREMISSAS!$C$6:$J$13,4,FALSE)))","v":0},null,{"$f":"IF($C38=\"\",0,IF($S38>VLOOKUP($C38,PREMISSAS!$C$6:$J$13,4,FALSE),$S38-VLOOKUP($C38,PREMISSAS!$C$6:$J$13,4,FALSE),0))","v":0},null,null,null,null,null,"","","","","","",""]
[null,null,4,{"$f":"IF(D38=\"\",\"\",IF((D38+1)>'PERIODOS E FERIADOS'!$G$6,\"\",D38+1))","v":"2023-05-31"},"Quarta",null,null,null,null,null,null,null,0,null,0,null,null,null,0,null,null,null,{"$f":"IF($C39=\"\",0,IF($S39<=VLOOKUP($C39,PREMISSAS!$C$6:$J$13,4,FALSE),$S39,VLOOKUP($C39,PREMISSAS!$C$6:$J$13,4,FALSE)))","v":0},null,{"$f":"IF($C39=\"\",0,IF($S39>VLOOKUP($C39,PREMISSAS!$C$6:$J$13,4,FALSE),$S39-VLOOKUP($C39,PREMISSAS!$C$6:$J$13,4,FALSE),0))","v":0},null,null,null,null,null,"","","","","","",""]
[]
[null,null,null,"TOTAIS",null,null,"Faltas / Suspensão",null,{"$f":"COUNTIF($F$9:$F$39,\"FALTA\")+COUNTIF($F$9:$F$39,\"SUSPENSÃO\")+COUNTIF($F$9:$F$39,\"SUSPENSO\")+COUNTIF($F$9:$F$39,\"SUSPENSAO\")","v":0},null,null,null,{"$f":"SUM($M$9:$M$39)","v":0},null,{"$f":"SUM($O$9:$O$39)","v":0},null,null,null,{"$f":"SUM(S$9:S$39)","v":0},null,{"$f":"$AK$41","v":0},null,{"$f":"SUM(W$9:W$39)","v":0},null,{"$f":"SUM(Y$9:Y$39)","v":0},null,null,null,null,null,null,null,null,null,null,null,{"$f":"SUM(AK9:AK39)","v":0}]
[]
[null,null,null,"OBSERVAÇÕES:"]

{"sheet":"FUNC 14","index":18,"n_rows":43,"n_cols":37,"rows_kept":43,"cut":false,"hidden":false,"merged":[[5,30,5,33],[40,3,40,5],[40,6,40,7],[40,8,40,10],[42,3,43,24],[18,26,18,27],[19,26,19,27],[3,3,4,27],[5,3,5,4],[5,5,5,10],[5,12,5,20],[5,22,5,24],[5,26,5,27]]}
[]
[]
[]
[null,null,null,{"$f":"'PERIODOS E FERIADOS'!$E$5","v":0}]
[]
[null,null,null,"Funcionário",null,{"$f":"FUNCIONÁRIOS!E18","v":14},null,null,null,null,null,null,"H.E. / Atrasos / A.N",null,null,null,null,null,null,null,null,null,"Distrib. H.E. p/ Faixa",null,null,null,"CARGA HORÁRIA",null,null,null,"ESPELHO"]
[]
[null,null,null,"Data","Dia Semana","Entrada","Saída","Entrada","Saída","Entrada","Saída",null,"H. Diária",null,"Atrasos",null,"Abona",null,"Horas Extras",null,"Adc. Noturno",null,{"$f":"PREMISSAS!H6","v":0.5},null,{"$f":"PREMISSAS!H12","v":1},2,"SEGUNDA",0.33333333333333331,2,null,"Entrada","Saída","Entrada","Saída","Entrada","Saída","AN "]
[null,null,{"$f":"IF(NOT(ISERROR(VLOOKUP(D9,rngFeriados,1,FALSE))),\"F\",IF(D9=\"\",\"\",WEEKDAY($D9,1)))","v":"F"},{"$f":"'PERIODOS E FERIADOS'!$E$6","v":"2023-05-01"},{"$f":"IF(D9=\"\",\"\",IF(WEEKDAY(D9,1)=1,\"Domingo\",IF(WEEKDAY(D9,1)=2,\"Segunda\",IF(WEEKDAY(D9,1)=3,\"Terça\",IF(WEEKDAY(D9,1)=4,\"Quarta\",IF(WEEKDAY(D9,1)=5,\"Quinta\",IF(WEEKDAY(D9,1)=6,\"Sexta\",IF(WEEKDAY(D9,1)=7,\"Sábado\"))))))))","v":"Segunda"},null,null,null,null,null,null,null,{"$f":"IF(ISERROR(IF(OR($AF9=\"\",$AF9=0),0,(IF(TEXT($AF9,\"[hh]:mm:ss\")<TEXT($AE9,\"[hh]:mm:ss\"),(1-$AE9+$AF9),$AF9-$AE9))+IF(OR($AH9=\"\",$AH9=0),0,(IF(TEXT($AH9,\"[hh]:mm:ss\")<TEXT($AG9,\"[hh]:mm:ss\"),(1-$AG9+$AH9),$AH9-$AG9))+IF(OR($AJ9=\"\",$AJ9=0),0,(IF(TEXT($AJ9,\"[hh]:mm:ss\")<TEXT($AI9,\"[hh]:mm:ss\"),(1-$AI9+$AJ9),$AJ9-$AI9)))))),0,IF(OR($AF9=\"\",$AF9=0),0,(IF(TEXT($AF9,\"[hh]:mm:ss\")<TEXT($AE9,\"[hh]:mm:ss\"),(1-$AE9+$AF9),$AF9-$AE9))+IF(OR($AH9=\"\",$AH9=0),0,(IF(TEXT($AH9,\"[hh]:mm:ss\")<TEXT($AG9,\"[hh]:mm:ss\"),(1-$AG9+$AH9),$AH9-$AG9))+IF(OR($AJ9=\"\",$AJ9=0),0,(IF(TEXT($AJ9,\"[hh]:mm:ss\")<TEXT($AI9,\"[hh]:mm:ss\"),(1-$AI9+$AJ9),$AJ9-$AI9))))))","v":0},null,{"$f":"IF($C9=\"\",0,IF(Q9=\"Sim\",0,IF(TEXT(IF(OR((VLOOKUP($C9,$Z$8:$AB$15,3,FALSE)-$M9)<0,$AE9=\"\"),0,(VLOOKUP($C9,$Z$8:$AB$15,3,FALSE)-$M9)),\"[hh]:mm\")<=TEXT(rngTolerancia,\"[hh]:mm\"),0,IF(OR((VLOOKUP($C9,$Z$8:$AB$15,3,FALSE)-$M9)<0,$AE9=\"\"),0,(VLOOKUP($C9,$Z$8:$AB$15,3,FALSE)-$M9)))))","v":0},null,null,null,{"$f":"IF($C9=\"\",0,IF(TEXT(IF(($M9-VLOOKUP($C9,$Z$8:$AB$15,3,FALSE))<0,0,($M9-VLOOKUP($C9,$Z$8:$AB$15,3,FALSE))),\"[hh]:mm\")<=TEXT(rngTolerancia,\"[hh]:mm\"),0,IF(($M9-VLOOKUP($C9,$Z$8:$AB$15,3,FALSE))<0,0,($M9-VLOOKUP($C9,$Z$8:$AB$15,3,FALSE)))))","v":0},null,null,null,{"$f":"IF($C9=\"\",0,IF($S9<=VLOOKUP($C9,PREMISSAS!$C$6:$J$13,4,FALSE),$S9,VLOOKUP($C9,PREMISSAS!$C$6:$J$13,4,FALSE)))","v":0},null,{"$f":"IF($C9=\"\",0,IF($S9>VLOOKUP($C9,PREMISSAS!$C$6:$J$13,4,FALSE),$S9-VLOOKUP($C9,PREMISSAS!$C$6:$J$13,4,FALSE),0))","v":0},3,"TERÇA",0.33333333333333331,3,null,{"$f":"IF(OR(F9=\"\",F9=0,F9=\"FALTA\",F9=\"SUSPENSO\",F9=\"SUSPENSÃO\"),\"\",TEXT(F9,\"##\"\":\"\"##\"))","v":""},{"$f":"IF(OR(G9=\"\",G9=0,G9=\"FALTA\",G9=\"SUSPENSO\",G9=\"SUSPENSÃO\"),\"\",TEXT(G9,\"##\"\":\"\"##\"))","v":""},"","",{"$f":"IF(OR(J9=\"\",J9=0,J9=\"FALTA\",J9=\"SUSPENSO\",J9=\"SUSPENSÃO\"),\"\",TEXT(J9,\"##\"\":\"\"##\"))","v":""},{"$f":"IF(OR(K9=\"\",K9=0,K9=\"FALTA\",K9=\"SUSPENSO\",K9=\"SUSPENSÃO\"),\"\",TEXT(K9,\"##\"\":\"\"##\"))","v":""},{"$f":"IF(OR(U9=\"\",U9=0,U9=\"FALTA\",U9=\"SUSPENSO\",U9=\"SUSPENSÃO\"),\"\",TEXT(TEXT(U9,\"00\"\":\"\"00\"),\"[hh]:mm\")*1)","v":""}]
[null,null,3,{"$f":"IF(D9=\"\",\"\",IF((D9+1)>'PERIODOS E FERIADOS'!$G$6,\"\",D9+1))","v":"2023-05-02"},{"$f":"IF(D10=\"\",\"\",IF(WEEKDAY(D10,1)=1,\"Domingo\",IF(WEEKDAY(D10,1)=2,\"Segunda\",IF(WEEKDAY(D10,1)=3,\"Terça\",IF(WEEKDAY(D10,1)=4,\"Quarta\",IF(WEEKDAY(D10,1)=5,\"Quinta\",IF(WEEKDAY(D10,1)=6,\"Sexta\",IF(WEEKDAY(D10,1)=7,\"Sábado\"))))))))","v":"Terça"},null,null,null,null,null,null,null,{"$f":"IF(ISERROR(IF(OR($AF10=\"\",$AF10=0),0,(IF(TEXT($AF10,\"[hh]:mm:ss\")<TEXT($AE10,\"[hh]:mm:ss\"),(1-$AE10+$AF10),$AF10-$AE10))+IF(OR($AH10=\"\",$AH10=0),0,(IF(TEXT($AH10,\"[hh]:mm:ss\")<TEXT($AG10,\"[hh]:mm:ss\"),(1-$AG10+$AH10),$AH10-$AG10))+IF(OR($AJ10=\"\",$AJ10=0),0,(IF(TEXT($AJ10,\"[hh]:mm:ss\")<TEXT($AI10,\"[hh]:mm:ss\"),(1-$AI10+$AJ10),$AJ10-$AI10)))))),0,IF(OR($AF10=\"\",$AF10=0),0,(IF(TEXT($AF10,\"[hh]:mm:ss\")<TEXT($AE10,\"[hh]:mm:ss\"),(1-$AE10+$AF10),$AF10-$AE10))+IF(OR($AH10=\"\",$AH10=0),0,(IF(TEXT($AH10,\"[hh]:mm:ss\")<TEXT($AG10,\"[hh]:mm:ss\"),(1-$AG10+$AH10),$AH10-$AG10))+IF(OR($AJ10=\"\",$AJ10=0),0,(IF(TEXT($AJ10,\"[hh]:mm:ss\")<TEXT($AI10,\"[hh]:mm:ss\"),(1-$AI10+$AJ10),$AJ10-$AI10))))))","v":0},null,{"$f":"IF($C10=\"\",0,IF(Q10=\"Sim\",0,IF(TEXT(IF(OR((VLOOKUP($C10,$Z$8:$AB$15,3,FALSE)-$M10)<0,$AE10=\"\"),0,(VLOOKUP($C10,$Z$8:$AB$15,3,FALSE)-$M10)),\"[hh]:mm\")<=TEXT(rngTolerancia,\"[hh]:mm\"),0,IF(OR((VLOOKUP($C10,$Z$8:$AB$15,3,FALSE)-$M10)<0,$AE10=\"\"),0,(VLOOKUP($C10,$Z$8:$AB$15,3,FALSE)-$M10)))))","v":0},null,null,null,{"$f":"IF($C10=\"\",0,IF(TEXT(IF(($M10-VLOOKUP($C10,$Z$8:$AB$15,3,FALSE))<0,0,($M10-VLOOKUP($C10,$Z$8:$AB$15,3,FALSE))),\"[hh]:mm\")<=TEXT(rngTolerancia,\"[hh]:mm\"),0,IF(($M10-VLOOKUP($C10,$Z$8:$AB$15,3,FALSE))<0,0,($M10-VLOOKUP($C10,$Z$8:$AB$15,3,FALSE)))))","v":0},null,null,null,{"$f":"IF($C10=\"\",0,IF($S10<=VLOOKUP($C10,PREMISSAS!$C$6:$J$13,4,FALSE),$S10,VLOOKUP($C10,PREMISSAS!$C$6:$J$13,4,FALSE)))","v":0},null,{"$f":"IF($C10=\"\",0,IF($S10>VLOOKUP($C10,PREMISSAS!$C$6:$J$13,4,FALSE),$S10-VLOOKUP($C10,PREMISSAS!$C$6:$J$13,4,FALSE),0))","v":0},4,"QUARTA",0.33333333333333331,4,null,{"$f":"IF(OR(F10=\"\",F10=0,F10=\"FALTA\",F10=\"SUSPENSO\",F10=\"SUSPENSÃO\"),\"\",TEXT(F10,\"##\"\":\"\"##\"))","v":""},"","","","","",{"$f":"IF(OR(U10=\"\",U10=0,U10=\"FALTA\",U10=\"SUSPENSO\",U10=\"SUSPENSÃO\"),\"\",TEXT(TEXT(U10,\"00\"\":\"\"00\"),\"[hh]:mm\")*1)","v":""}]
[null,null,4,{"$f":"IF(D10=\"\",\"\",IF((D10+1)>'PERIODOS E FERIADOS'!$G$6,\"\",D10+1))","v":"2023-05-03"},"Quarta",null,null,null,null,null,null,null,0,null,0,null,null,null,0,null,null,null,{"$f":"IF($C11=\"\",0,IF($S11<=VLOOKUP($C11,PREMISSAS!$C$6:$J$13,4,FALSE),$S11,VLOOKUP($C11,PREMISSAS!$C$6:$J$13,4,FALSE)))","v":0},null,{"$f":"IF($C11=\"\",0,IF($S11>VLOOKUP($C11,PREMISSAS!$C$6:$J$13,4,FALSE),$S11-VLOOKUP($C11,PREMISSAS!$C$6:$J$13,4,FALSE),0))","v":0},5,"QUINTA",0.33333333333333331,5,null,"","","","","","",""]
[null,null,5,{"$f":"IF(D11=\"\",\"\",IF((D11+1)>'PERIODOS E FERIADOS'!$G$6,\"\",D11+1))","v":"2023-05-04"},"Quinta",null,null,null,null,null,null,null,0,null,0,null,null,null,0,null,null,null,{"$f":"IF($C12=\"\",0,IF($S12<=VLOOKUP($C12,PREMISSAS!$C$6:$J$13,4,FALSE),$S12,VLOOKUP($C12,PREMISSAS!$C$6:$J$13,4,FALSE)))","v":0},null,{"$f":"IF($C12=\"\",0,IF($S12>VLOOKUP($C12,PREMISSAS!$C$6:$J$13,4,FALSE),$S12-VLOOKUP($C12,PREMISSAS!$C$6:$J$13,4,FALSE),0))","v":0},6,"SEXTA",0.33333333333333331,6,null,"","","","","","",{"$f":"IF(OR(U12=\"\",U12=0,U12=\"FALTA\",U12=\"SUSPENSO\",U12=\"SUSPENSÃO\"),\"\",TEXT(TEXT(U12,\"##\"\":\"\"##\"),\"[hh]:mm\")*1)","v":""}]
[null,null,6,{"$f":"IF(D12=\"\",\"\",IF((D12+1)>'PERIODOS E FERIADOS'!$G$6,\"\",D12+1))","v":"2023-05-05"},"Sexta",null,null,null,null,null,null,null,0,null,0,null,null,null,0,null,null,null,{"$f":"IF($C13=\"\",0,IF($S13<=VLOOKUP($C13,PREMISSAS!$C$6:$J$13,4,FALSE),$S13,VLOOKUP($C13,PREMISSAS!$C$6:$J$13,4,FALSE)))","v":0},null,{"$f":"IF($C13=\"\",0,IF($S13>VLOOKUP($C13,PREMISSAS!$C$6:$J$13,4,FALSE),$S13-VLOOKUP($C13,PREMISSAS!$C$6:$J$13,4,FALSE),0))","v":0},7,"SÁBADO",0.16666666666666666,7,null,"","","","","","",""]
[null,null,7,{"$f":"IF(D13=\"\",\"\",IF((D13+1)>'PERIODOS E FERIADOS'!$G$6,\"\",D13+1))","v":"2023-05-06"},"Sábado",null,null,null,null,null,null,null,0,null,0,null,null,null,0,null,null,null,{"$f":"IF($C14=\"\",0,IF($S14<=VLOOKUP($C14,PREMISSAS!$C$6:$J$13,4,FALSE),$S14,VLOOKUP($C14,PREMISSAS!$C$6:$J$13,4,FALSE)))","v":0},null,{"$f":"IF($C14=\"\",0,IF($S14>VLOOKUP($C14,PREMISSAS!$C$6:$J$13,4,FALSE),$S14-VLOOKUP($C14,PREMISSAS!$C$6:$J$13,4,FALSE),0))","v":0},1,"DOMINGO",0,1,null,"","","","","","",""]
[null,null,1,{"$f":"IF(D14=\"\",\"\",IF((D14+1)>'PERIODOS E FERIADOS'!$G$6,\"\",D14+1))","v":"2023-05-07"},"Domingo",null,null,null,null,null,null,null,0,null,0,null,null,null,0,null,null,null,{"$f":"IF($C15=\"\",0,IF($S15<=VLOOKUP($C15,PREMISSAS!$C$6:$J$13,4,FALSE),$S15,VLOOKUP($C15,PREMISSAS!$C$6:$J$13,4,FALSE)))","v":0},null,{"$f":"IF($C15=\"\",0,IF($S15>VLOOKUP($C15,PREMISSAS!$C$6:$J$13,4,FALSE),$S15-VLOOKUP($C15,PREMISSAS!$C$6:$J$13,4,FALSE),0))","v":0},"F","FERIADOS",0,"F",null,"","","","","","",""]
[null,null,2,{"$f":"IF(D15=\"\",\"\",IF((D15+1)>'PERIODOS E FERIADOS'!$G$6,\"\",D15+1))","v":"2023-05-08"},"Segunda",null,null,null,null,null,null,null,0,null,0,null,null,null,0,null,null,null,{"$f":"IF($C16=\"\",0,IF($S16<=VLOOKUP($C16,PREMISSAS!$C$6:$J$13,4,FALSE),$S16,VLOOKUP($C16,PREMISSAS!$C$6:$J$13,4,FALSE)))","v":0},null,{"$f":"IF($C16=\"\",0,IF($S16>VLOOKUP($C16,PREMISSAS!$C$6:$J$13,4,FALSE),$S16-VLOOKUP($C16,PREMISSAS!$C$6:$J$13,4,FALSE),0))","v":0},null,"TOTAL SEMANA",{"$f":"SUM(AB8:AB15)","v":1.8333333333333333},null,null,"","","","","","",""]
[null,null,3,{"$f":"IF(D16=\"\",\"\",IF((D16+1)>'PERIODOS E FERIADOS'!$G$6,\"\",D16+1))","v":"2023-05-09"},"Terça",null,null,null,null,null,null,null,0,null,0,null,null,null,0,null,null,null,{"$f":"IF($C17=\"\",0,IF($S17<=VLOOKUP($C17,PREMISSAS!$C$6:$J$13,4,FALSE),$S17,VLOOKUP($C17,PREMISSAS!$C$6:$J$13,4,FALSE)))","v":0},null,{"$f":"IF($C17=\"\",0,IF($S17>VLOOKUP($C17,PREMISSAS!$C$6:$J$13,4,FALSE),$S17-VLOOKUP($C17,PREMISSAS!$C$6:$J$13,4,FALSE),0))","v":0},null,"JORNADA MENSAL",{"$f":"AB16*5","v":9.1666666666666661},null,null,"","","","","","",""]
[null,null,4,{"$f":"IF(D17=\"\",\"\",IF((D17+1)>'PERIODOS E FERIADOS'!$G$6,\"\",D17+1))","v":"2023-05-10"},"Quarta",null,null,null,null,null,null,null,0,null,0,null,null,null,0,null,null,null,{"$f":"IF($C18=\"\",0,IF($S18<=VLOOKUP($C18,PREMISSAS!$C$6:$J$13,4,FALSE),$S18,VLOOKUP($C18,PREMISSAS!$C$6:$J$13,4,FALSE)))","v":0},null,{"$f":"IF($C18=\"\",0,IF($S18>VLOOKUP($C18,PREMISSAS!$C$6:$J$13,4,FALSE),$S18-VLOOKUP($C18,PREMISSAS!$C$6:$J$13,4,FALSE),0))","v":0},null,null,null,null,null,"","","","","","",""]
[null,null,5,{"$f":"IF(D18=\"\",\"\",IF((D18+1)>'PERIODOS E FERIADOS'!$G$6,\"\",D18+1))","v":"2023-05-11"},"Quinta",null,null,null,null,null,null,null,0,null,0,null,null,null,0,null,null,null,{"$f":"IF($C19=\"\",0,IF($S19<=VLOOKUP($C19,PREMISSAS!$C$6:$J$13,4,FALSE),$S19,VLOOKUP($C19,PREMISSAS!$C$6:$J$13,4,FALSE)))","v":0},null,{"$f":"IF($C19=\"\",0,IF($S19>VLOOKUP($C19,PREMISSAS!$C$6:$J$13,4,FALSE),$S19-VLOOKUP($C19,PREMISSAS!$C$6:$J$13,4,FALSE),0))","v":0},null,{"$f":"IF(AB$16>AB$23,\"Jornada Superior a permitida\",IF(AB$16<=AB$23,\"\"))","v":""},null,null,null,"","","","","","",""]
[null,null,6,{"$f":"IF(D19=\"\",\"\",IF((D19+1)>'PERIODOS E FERIADOS'!$G$6,\"\",D19+1))","v":"2023-05-12"},"Sexta",null,null,null,null,null,null,null,0,null,0,null,null,null,0,null,null,null,{"$f":"IF($C20=\"\",0,IF($S20<=VLOOKUP($C20,PREMISSAS!$C$6:$J$13,4,FALSE),$S20,VLOOKUP($C20,PREMISSAS!$C$6:$J$13,4,FALSE)))","v":0},null,{"$f":"IF($C20=\"\",0,IF($S20>VLOOKUP($C20,PREMISSAS!$C$6:$J$13,4,FALSE),$S20-VLOOKUP($C20,PREMISSAS!$C$6:$J$13,4,FALSE),0))","v":0},null,{"$f":"IF(AB$16>AB$23,\"\",IF(AB$16<=AB$23,\"Jornada Ok\"))","v":"Jornada Ok"},null,null,null,"","","","","","",""]
[null,null,7,{"$f":"IF(D20=\"\",\"\",IF((D20+1)>'PERIODOS E FERIADOS'!$G$6,\"\",D20+1))","v":"2023-05-13"},"Sábado",null,null,null,null,null,null,null,0,null,0,null,null,null,0,null,null,null,{"$f":"IF($C21=\"\",0,IF($S21<=VLOOKUP($C21,PREMISSAS!$C$6:$J$13,4,FALSE),$S21,VLOOKUP($C21,PREMISSAS!$C$6:$J$13,4,FALSE)))","v":0},null,{"$f":"IF($C21=\"\",0,IF($S21>VLOOKUP($C21,PREMISSAS!$C$6:$J$13,4,FALSE),$S21-VLOOKUP($C21,PREMISSAS!$C$6:$J$13,4,FALSE),0))","v":0},null,null,null,null,null,"","","","","","",""]
[null,null,1,{"$f":"IF(D21=\"\",\"\",IF((D21+1)>'PERIODOS E FERIADOS'!$G$6,\"\",D21+1))","v":"2023-05-14"},"Domingo",null,null,null,null,null,null,null,0,null,0,null,null,null,0,null,null,null,{"$f":"IF($C22=\"\",0,IF($S22<=VLOOKUP($C22,PREMISSAS!$C$6:$J$13,4,FALSE),$S22,VLOOKUP($C22,PREMISSAS!$C$6:$J$13,4,FALSE)))","v":0},null,{"$f":"IF($C22=\"\",0,IF($S22>VLOOKUP($C22,PREMISSAS!$C$6:$J$13,4,FALSE),$S22-VLOOKUP($C22,PREMISSAS!$C$6:$J$13,4,FALSE),0))","v":0},null,null,null,null,null,"","","","","","",""]
[null,null,2,{"$f":"IF(D22=\"\",\"\",IF((D22+1)>'PERIODOS E FERIADOS'!$G$6,\"\",D22+1))","v":"2023-05-15"},"Segunda",null,null,null,null,null,null,null,0,null,0,null,null,null,0,null,null,null,{"$f":"IF($C23=\"\",0,IF($S23<=VLOOKUP($C23,PREMISSAS!$C$6:$J$13,4,FALSE),$S23,VLOOKUP($C23,PREMISSAS!$C$6:$J$13,4,FALSE)))","v":0},null,{"$f":"IF($C23=\"\",0,IF($S23>VLOOKUP($C23,PREMISSAS!$C$6:$J$13,4,FALSE),$S23-VLOOKUP($C23,PREMISSAS!$C$6:$J$13,4,FALSE),0))","v":0},null,"Jornada Maxima",1.8333333333333333,null,null,"","","","","","",""]
[null,null,3,{"$f":"IF(D23=\"\",\"\",IF((D23+1)>'PERIODOS E FERIADOS'!$G$6,\"\",D23+1))","v":"2023-05-16"},"Terça",null,null,null,null,null,null,null,0,null,0,null,null,null,0,null,null,null,{"$f":"IF($C24=\"\",0,IF($S24<=VLOOKUP($C24,PREMISSAS!$C$6:$J$13,4,FALSE),$S24,VLOOKUP($C24,PREMISSAS!$C$6:$J$13,4,FALSE)))","v":0},null,{"$f":"IF($C24=\"\",0,IF($S24>VLOOKUP($C24,PREMISSAS!$C$6:$J$13,4,FALSE),$S24-VLOOKUP($C24,PREMISSAS!$C$6:$J$13,4,FALSE),0))","v":0},null,null,null,null,null,"","","","","","",""]
[null,null,4,{"$f":"IF(D24=\"\",\"\",IF((D24+1)>'PERIODOS E FERIADOS'!$G$6,\"\",D24+1))","v":"2023-05-17"},"Quarta",null,null,null,null,null,null,null,0,null,0,null,null,null,0,null,null,null,{"$f":"IF($C25=\"\",0,IF($S25<=VLOOKUP($C25,PREMISSAS!$C$6:$J$13,4,FALSE),$S25,VLOOKUP($C25,PREMISSAS!$C$6:$J$13,4,FALSE)))","v":0},null,{"$f":"IF($C25=\"\",0,IF($S25>VLOOKUP($C25,PREMISSAS!$C$6:$J$13,4,FALSE),$S25-VLOOKUP($C25,PREMISSAS!$C$6:$J$13,4,FALSE),0))","v":0},null,null,null,null,null,"","","","","","",""]
[null,null,5,{"$f":"IF(D25=\"\",\"\",IF((D25+1)>'PERIODOS E FERIADOS'!$G$6,\"\",D25+1))","v":"2023-05-18"},"Quinta",null,null,null,null,null,null,null,0,null,0,null,null,null,0,null,null,null,{"$f":"IF($C26=\"\",0,IF($S26<=VLOOKUP($C26,PREMISSAS!$C$6:$J$13,4,FALSE),$S26,VLOOKUP($C26,PREMISSAS!$C$6:$J$13,4,FALSE)))","v":0},null,{"$f":"IF($C26=\"\",0,IF($S26>VLOOKUP($C26,PREMISSAS!$C$6:$J$13,4,FALSE),$S26-VLOOKUP($C26,PREMISSAS!$C$6:$J$13,4,FALSE),0))","v":0},null,null,null,null,null,"","","","","","",""]
[null,null,6,{"$f":"IF(D26=\"\",\"\",IF((D26+1)>'PERIODOS E FERIADOS'!$G$6,\"\",D26+1))","v":"2023-05-19"},"Sexta",null,null,null,null,null,null,null,0,null,0,null,null,null,0,null,null,null,{"$f":"IF($C27=\"\",0,IF($S27<=VLOOKUP($C27,PREMISSAS!$C$6:$J$13,4,FALSE),$S27,VLOOKUP($C27,PREMISSAS!$C$6:$J$13,4,FALSE)))","v":0},null,{"$f":"IF($C27=\"\",0,IF($S27>VLOOKUP($C27,PREMISSAS!$C$6:$J$13,4,FALSE),$S27-VLOOKUP($C27,PREMISSAS!$C$6:$J$13,4,FALSE),0))","v":0},null,null,null,null,null,"","","","","","",""]
[null,null,7,{"$f":"IF(D27=\"\",\"\",IF((D27+1)>'PERIODOS E FERIADOS'!$G$6,\"\",D27+1))","v":"2023-05-20"},"Sábado",null,null,null,null,null,null,null,0,null,0,null,null,null,0,null,null,null,{"$f":"IF($C28=\"\",0,IF($S28<=VLOOKUP($C28,PREMISSAS!$C$6:$J$13,4,FALSE),$S28,VLOOKUP($C28,PREMISSAS!$C$6:$J$13,4,FALSE)))","v":0},null,{"$f":"IF($C28=\"\",0,IF($S28>VLOOKUP($C28,PREMISSAS!$C$6:$J$13,4,FALSE),$S28-VLOOKUP($C28,PREMISSAS!$C$6:$J$13,4,FALSE),0))","v":0},null,null,null,null,null,"","","","","","",""]
[null,null,1,{"$f":"IF(D28=\"\",\"\",IF((D28+1)>'PERIODOS E FERIADOS'!$G$6,\"\",D28+1))","v":"2023-05-21"},"Domingo",null,null,null,null,null,null,null,0,null,0,null,null,null,0,null,null,null,{"$f":"IF($C29=\"\",0,IF($S29<=VLOOKUP($C29,PREMISSAS!$C$6:$J$13,4,FALSE),$S29,VLOOKUP($C29,PREMISSAS!$C$6:$J$13,4,FALSE)))","v":0},null,{"$f":"IF($C29=\"\",0,IF($S29>VLOOKUP($C29,PREMISSAS!$C$6:$J$13,4,FALSE),$S29-VLOOKUP($C29,PREMISSAS!$C$6:$J$13,4,FALSE),0))","v":0},null,null,null,null,null,"","","","","","",""]
[null,null,2,{"$f":"IF(D29=\"\",\"\",IF((D29+1)>'PERIODOS E FERIADOS'!$G$6,\"\",D29+1))","v":"2023-05-22"},"Segunda",null,null,null,null,null,null,null,0,null,0,null,null,null,0,null,null,null,{"$f":"IF($C30=\"\",0,IF($S30<=VLOOKUP($C30,PREMISSAS!$C$6:$J$13,4,FALSE),$S30,VLOOKUP($C30,PREMISSAS!$C$6:$J$13,4,FALSE)))","v":0},null,{"$f":"IF($C30=\"\",0,IF($S30>VLOOKUP($C30,PREMISSAS!$C$6:$J$13,4,FALSE),$S30-VLOOKUP($C30,PREMISSAS!$C$6:$J$13,4,FALSE),0))","v":0},null,null,null,null,null,"","","","","","",""]
[null,null,3,{"$f":"IF(D30=\"\",\"\",IF((D30+1)>'PERIODOS E FERIADOS'!$G$6,\"\",D30+1))","v":"2023-05-23"},"Terça",null,null,null,null,null,null,null,0,null,0,null,null,null,0,null,null,null,{"$f":"IF($C31=\"\",0,IF($S31<=VLOOKUP($C31,PREMISSAS!$C$6:$J$13,4,FALSE),$S31,VLOOKUP($C31,PREMISSAS!$C$6:$J$13,4,FALSE)))","v":0},null,{"$f":"IF($C31=\"\",0,IF($S31>VLOOKUP($C31,PREMISSAS!$C$6:$J$13,4,FALSE),$S31-VLOOKUP($C31,PREMISSAS!$C$6:$J$13,4,FALSE),0))","v":0},null,null,null,null,null,"","","","","","",""]
[null,null,4,{"$f":"IF(D31=\"\",\"\",IF((D31+1)>'PERIODOS E FERIADOS'!$G$6,\"\",D31+1))","v":"2023-05-24"},"Quarta",null,null,null,null,null,null,null,0,null,0,null,null,null,0,null,null,null,{"$f":"IF($C32=\"\",0,IF($S32<=VLOOKUP($C32,PREMISSAS!$C$6:$J$13,4,FALSE),$S32,VLOOKUP($C32,PREMISSAS!$C$6:$J$13,4,FALSE)))","v":0},null,{"$f":"IF($C32=\"\",0,IF($S32>VLOOKUP($C32,PREMISSAS!$C$6:$J$13,4,FALSE),$S32-VLOOKUP($C32,PREMISSAS!$C$6:$J$13,4,FALSE),0))","v":0},null,null,null,null,null,{"$f":"IF(OR(F32=\"\",F32=0,F32=\"FALTA\",F32=\"SUSPENSO\",F32=\"SUSPENSÃO\"),\"\",TEXT(F32,\"##\"\":\"\"##\"))","v":""},{"$f":"IF(OR(G32=\"\",G32=0,G32=\"FALTA\",G32=\"SUSPENSO\",G32=\"SUSPENSÃO\"),\"\",TEXT(G32,\"##\"\":\"\"##\"))","v":""},"","",{"$f":"IF(OR(J32=\"\",J32=0,J32=\"FALTA\",J32=\"SUSPENSO\",J32=\"SUSPENSÃO\"),\"\",TEXT(J32,\"##\"\":\"\"##\"))","v":""},{"$f":"IF(OR(K32=\"\",K32=0,K32=\"FALTA\",K32=\"SUSPENSO\",K32=\"SUSPENSÃO\"),\"\",TEXT(K32,\"##\"\":\"\"##\"))","v":""},""]
[null,null,5,{"$f":"IF(D32=\"\",\"\",IF((D32+1)>'PERIODOS E FERIADOS'!$G$6,\"\",D32+1))","v":"2023-05-25"},"Quinta",null,null,null,null,null,null,null,0,null,0,null,null,null,0,null,null,null,{"$f":"IF($C33=\"\",0,IF($S33<=VLOOKUP($C33,PREMISSAS!$C$6:$J$13,4,FALSE),$S33,VLOOKUP($C33,PREMISSAS!$C$6:$J$13,4,FALSE)))","v":0},null,{"$f":"IF($C33=\"\",0,IF($S33>VLOOKUP($C33,PREMISSAS!$C$6:$J$13,4,FALSE),$S33-VLOOKUP($C33,PREMISSAS!$C$6:$J$13,4,FALSE),0))","v":0},null,null,null,null,null,{"$f":"IF(OR(F33=\"\",F33=0,F33=\"FALTA\",F33=\"SUSPENSO\",F33=\"SUSPENSÃO\"),\"\",TEXT(F33,\"##\"\":\"\"##\"))","v":""},"","","","","",""]
[null,null,6,{"$f":"IF(D33=\"\",\"\",IF((D33+1)>'PERIODOS E FERIADOS'!$G$6,\"\",D33+1))","v":"2023-05-26"},"Sexta",null,null,null,null,null,null,null,0,null,0,null,null,null,0,null,null,null,{"$f":"IF($C34=\"\",0,IF($S34<=VLOOKUP($C34,PREMISSAS!$C$6:$J$13,4,FALSE),$S34,VLOOKUP($C34,PREMISSAS!$C$6:$J$13,4,FALSE)))","v":0},null,{"$f":"IF($C34=\"\",0,IF($S34>VLOOKUP($C34,PREMISSAS!$C$6:$J$13,4,FALSE),$S34-VLOOKUP($C34,PREMISSAS!$C$6:$J$13,4,FALSE),0))","v":0},null,null,null,null,null,"","","","","","",""]
[null,null,7,{"$f":"IF(D34=\"\",\"\",IF((D34+1)>'PERIODOS E FERIADOS'!$G$6,\"\",D34+1))","v":"2023-05-27"},"Sábado",null,null,null,null,null,null,null,0,null,0,null,null,null,0,null,null,null,{"$f":"IF($C35=\"\",0,IF($S35<=VLOOKUP($C35,PREMISSAS!$C$6:$J$13,4,FALSE),$S35,VLOOKUP($C35,PREMISSAS!$C$6:$J$13,4,FALSE)))","v":0},null,{"$f":"IF($C35=\"\",0,IF($S35>VLOOKUP($C35,PREMISSAS!$C$6:$J$13,4,FALSE),$S35-VLOOKUP($C35,PREMISSAS!$C$6:$J$13,4,FALSE),0))","v":0},null,null,null,null,null,"","","","","","",""]
[null,null,1,{"$f":"IF(D35=\"\",\"\",IF((D35+1)>'PERIODOS E FERIADOS'!$G$6,\"\",D35+1))","v":"2023-05-28"},"Domingo",null,null,null,null,null,null,null,0,null,0,null,null,null,0,null,null,null,{"$f":"IF($C36=\"\",0,IF($S36<=VLOOKUP($C36,PREMISSAS!$C$6:$J$13,4,FALSE),$S36,VLOOKUP($C36,PREMISSAS!$C$6:$J$13,4,FALSE)))","v":0},null,{"$f":"IF($C36=\"\",0,IF($S36>VLOOKUP($C36,PREMISSAS!$C$6:$J$13,4,FALSE),$S36-VLOOKUP($C36,PREMISSAS!$C$6:$J$13,4,FALSE),0))","v":0},null,null,null,null,null,"","","","","","",""]
[null,null,2,{"$f":"IF(D36=\"\",\"\",IF((D36+1)>'PERIODOS E FERIADOS'!$G$6,\"\",D36+1))","v":"2023-05-29"},"Segunda",null,null,null,null,null,null,null,0,null,0,null,null,null,0,null,null,null,{"$f":"IF($C37=\"\",0,IF($S37<=VLOOKUP($C37,PREMISSAS!$C$6:$J$13,4,FALSE),$S37,VLOOKUP($C37,PREMISSAS!$C$6:$J$13,4,FALSE)))","v":0},null,{"$f":"IF($C37=\"\",0,IF($S37>VLOOKUP($C37,PREMISSAS!$C$6:$J$13,4,FALSE),$S37-VLOOKUP($C37,PREMISSAS!$C$6:$J$13,4,FALSE),0))","v":0},null,null,null,null,null,"","","","","","",""]
[null,null,3,{"$f":"IF(D37=\"\",\"\",IF((D37+1)>'PERIODOS E FERIADOS'!$G$6,\"\",D37+1))","v":"2023-05-30"},"Terça",null,null,null,null,null,null,null,0,null,0,null,null,null,0,null,null,null,{"$f":"IF($C38=\"\",0,IF($S38<=VLOOKUP($C38,PREMISSAS!$C$6:$J$13,4,FALSE),$S38,VLOOKUP($C38,PREMISSAS!$C$6:$J$13,4,FALSE)))","v":0},null,{"$f":"IF($C38=\"\",0,IF($S38>VLOOKUP($C38,PREMISSAS!$C$6:$J$13,4,FALSE),$S38-VLOOKUP($C38,PREMISSAS!$C$6:$J$13,4,FALSE),0))","v":0},null,null,null,null,null,"","","","","","",""]
[null,null,4,{"$f":"IF(D38=\"\",\"\",IF((D38+1)>'PERIODOS E FERIADOS'!$G$6,\"\",D38+1))","v":"2023-05-31"},"Quarta",null,null,null,null,null,null,null,0,null,0,null,null,null,0,null,null,null,{"$f":"IF($C39=\"\",0,IF($S39<=VLOOKUP($C39,PREMISSAS!$C$6:$J$13,4,FALSE),$S39,VLOOKUP($C39,PREMISSAS!$C$6:$J$13,4,FALSE)))","v":0},null,{"$f":"IF($C39=\"\",0,IF($S39>VLOOKUP($C39,PREMISSAS!$C$6:$J$13,4,FALSE),$S39-VLOOKUP($C39,PREMISSAS!$C$6:$J$13,4,FALSE),0))","v":0},null,null,null,null,null,"","","","","","",""]
[]
[null,null,null,"TOTAIS",null,null,"Faltas / Suspensão",null,{"$f":"COUNTIF($F$9:$F$39,\"FALTA\")+COUNTIF($F$9:$F$39,\"SUSPENSÃO\")+COUNTIF($F$9:$F$39,\"SUSPENSO\")+COUNTIF($F$9:$F$39,\"SUSPENSAO\")","v":0},null,null,null,{"$f":"SUM($M$9:$M$39)","v":0},null,{"$f":"SUM($O$9:$O$39)","v":0},null,null,null,{"$f":"SUM(S$9:S$39)","v":0},null,{"$f":"$AK$41","v":0},null,{"$f":"SUM(W$9:W$39)","v":0},null,{"$f":"SUM(Y$9:Y$39)","v":0},null,null,null,null,null,null,null,null,null,null,null,{"$f":"SUM(AK9:AK39)","v":0}]
[]
[null,null,null,"OBSERVAÇÕES:"]

{"sheet":"FUNC 15","index":19,"n_rows":43,"n_cols":37,"rows_kept":43,"cut":false,"hidden":false,"merged":[[5,30,5,33],[40,3,40,5],[40,6,40,7],[40,8,40,10],[42,3,43,24],[18,26,18,27],[19,26,19,27],[3,3,4,27],[5,3,5,4],[5,5,5,10],[5,12,5,20],[5,22,5,24],[5,26,5,27]]}
[]
[]
[]
[null,null,null,{"$f":"'PERIODOS E FERIADOS'!$E$5","v":0}]
[]
[null,null,null,"Funcionário",null,{"$f":"FUNCIONÁRIOS!E19","v":15},null,null,null,null,null,null,"H.E. / Atrasos / A.N",null,null,null,null,null,null,null,null,null,"Distrib. H.E. p/ Faixa",null,null,null,"CARGA HORÁRIA",null,null,null,"ESPELHO"]
[]
[null,null,null,"Data","Dia Semana","Entrada","Saída","Entrada","Saída","Entrada","Saída",null,"H. Diária",null,"Atrasos",null,"Abona",null,"Horas Extras",null,"Adc. Noturno",null,{"$f":"PREMISSAS!H6","v":0.5},null,{"$f":"PREMISSAS!H12","v":1},2,"SEGUNDA",0.33333333333333331,2,null,"Entrada","Saída","Entrada","Saída","Entrada","Saída","AN "]
[null,null,{"$f":"IF(NOT(ISERROR(VLOOKUP(D9,rngFeriados,1,FALSE))),\"F\",IF(D9=\"\",\"\",WEEKDAY($D9,1)))","v":"F"},{"$f":"'PERIODOS E FERIADOS'!$E$6","v":"2023-05-01"},{"$f":"IF(D9=\"\",\"\",IF(WEEKDAY(D9,1)=1,\"Domingo\",IF(WEEKDAY(D9,1)=2,\"Segunda\",IF(WEEKDAY(D9,1)=3,\"Terça\",IF(WEEKDAY(D9,1)=4,\"Quarta\",IF(WEEKDAY(D9,1)=5,\"Quinta\",IF(WEEKDAY(D9,1)=6,\"Sexta\",IF(WEEKDAY(D9,1)=7,\"Sábado\"))))))))","v":"Segunda"},null,null,null,null,null,null,null,{"$f":"IF(ISERROR(IF(OR($AF9=\"\",$AF9=0),0,(IF(TEXT($AF9,\"[hh]:mm:ss\")<TEXT($AE9,\"[hh]:mm:ss\"),(1-$AE9+$AF9),$AF9-$AE9))+IF(OR($AH9=\"\",$AH9=0),0,(IF(TEXT($AH9,\"[hh]:mm:ss\")<TEXT($AG9,\"[hh]:mm:ss\"),(1-$AG9+$AH9),$AH9-$AG9))+IF(OR($AJ9=\"\",$AJ9=0),0,(IF(TEXT($AJ9,\"[hh]:mm:ss\")<TEXT($AI9,\"[hh]:mm:ss\"),(1-$AI9+$AJ9),$AJ9-$AI9)))))),0,IF(OR($AF9=\"\",$AF9=0),0,(IF(TEXT($AF9,\"[hh]:mm:ss\")<TEXT($AE9,\"[hh]:mm:ss\"),(1-$AE9+$AF9),$AF9-$AE9))+IF(OR($AH9=\"\",$AH9=0),0,(IF(TEXT($AH9,\"[hh]:mm:ss\")<TEXT($AG9,\"[hh]:mm:ss\"),(1-$AG9+$AH9),$AH9-$AG9))+IF(OR($AJ9=\"\",$AJ9=0),0,(IF(TEXT($AJ9,\"[hh]:mm:ss\")<TEXT($AI9,\"[hh]:mm:ss\"),(1-$AI9+$AJ9),$AJ9-$AI9))))))","v":0},null,{"$f":"IF($C9=\"\",0,IF(Q9=\"Sim\",0,IF(TEXT(IF(OR((VLOOKUP($C9,$Z$8:$AB$15,3,FALSE)-$M9)<0,$AE9=\"\"),0,(VLOOKUP($C9,$Z$8:$AB$15,3,FALSE)-$M9)),\"[hh]:mm\")<=TEXT(rngTolerancia,\"[hh]:mm\"),0,IF(OR((VLOOKUP($C9,$Z$8:$AB$15,3,FALSE)-$M9)<0,$AE9=\"\"),0,(VLOOKUP($C9,$Z$8:$AB$15,3,FALSE)-$M9)))))","v":0},null,null,null,{"$f":"IF($C9=\"\",0,IF(TEXT(IF(($M9-VLOOKUP($C9,$Z$8:$AB$15,3,FALSE))<0,0,($M9-VLOOKUP($C9,$Z$8:$AB$15,3,FALSE))),\"[hh]:mm\")<=TEXT(rngTolerancia,\"[hh]:mm\"),0,IF(($M9-VLOOKUP($C9,$Z$8:$AB$15,3,FALSE))<0,0,($M9-VLOOKUP($C9,$Z$8:$AB$15,3,FALSE)))))","v":0},null,null,null,{"$f":"IF($C9=\"\",0,IF($S9<=VLOOKUP($C9,PREMISSAS!$C$6:$J$13,4,FALSE),$S9,VLOOKUP($C9,PREMISSAS!$C$6:$J$13,4,FALSE)))","v":0},null,{"$f":"IF($C9=\"\",0,IF($S9>VLOOKUP($C9,PREMISSAS!$C$6:$J$13,4,FALSE),$S9-VLOOKUP($C9,PREMISSAS!$C$6:$J$13,4,FALSE),0))","v":0},3,"TERÇA",0.33333333333333331,3,null,{"$f":"IF(OR(F9=\"\",F9=0,F9=\"FALTA\",F9=\"SUSPENSO\",F9=\"SUSPENSÃO\"),\"\",TEXT(F9,\"##\"\":\"\"##\"))","v":""},{"$f":"IF(OR(G9=\"\",G9=0,G9=\"FALTA\",G9=\"SUSPENSO\",G9=\"SUSPENSÃO\"),\"\",TEXT(G9,\"##\"\":\"\"##\"))","v":""},"","",{"$f":"IF(OR(J9=\"\",J9=0,J9=\"FALTA\",J9=\"SUSPENSO\",J9=\"SUSPENSÃO\"),\"\",TEXT(J9,\"##\"\":\"\"##\"))","v":""},{"$f":"IF(OR(K9=\"\",K9=0,K9=\"FALTA\",K9=\"SUSPENSO\",K9=\"SUSPENSÃO\"),\"\",TEXT(K9,\"##\"\":\"\"##\"))","v":""},{"$f":"IF(OR(U9=\"\",U9=0,U9=\"FALTA\",U9=\"SUSPENSO\",U9=\"SUSPENSÃO\"),\"\",TEXT(TEXT(U9,\"00\"\":\"\"00\"),\"[hh]:mm\")*1)","v":""}]
[null,null,3,{"$f":"IF(D9=\"\",\"\",IF((D9+1)>'PERIODOS E FERIADOS'!$G$6,\"\",D9+1))","v":"2023-05-02"},{"$f":"IF(D10=\"\",\"\",IF(WEEKDAY(D10,1)=1,\"Domingo\",IF(WEEKDAY(D10,1)=2,\"Segunda\",IF(WEEKDAY(D10,1)=3,\"Terça\",IF(WEEKDAY(D10,1)=4,\"Quarta\",IF(WEEKDAY(D10,1)=5,\"Quinta\",IF(WEEKDAY(D10,1)=6,\"Sexta\",IF(WEEKDAY(D10,1)=7,\"Sábado\"))))))))","v":"Terça"},null,null,null,null,null,null,null,{"$f":"IF(ISERROR(IF(OR($AF10=\"\",$AF10=0),0,(IF(TEXT($AF10,\"[hh]:mm:ss\")<TEXT($AE10,\"[hh]:mm:ss\"),(1-$AE10+$AF10),$AF10-$AE10))+IF(OR($AH10=\"\",$AH10=0),0,(IF(TEXT($AH10,\"[hh]:mm:ss\")<TEXT($AG10,\"[hh]:mm:ss\"),(1-$AG10+$AH10),$AH10-$AG10))+IF(OR($AJ10=\"\",$AJ10=0),0,(IF(TEXT($AJ10,\"[hh]:mm:ss\")<TEXT($AI10,\"[hh]:mm:ss\"),(1-$AI10+$AJ10),$AJ10-$AI10)))))),0,IF(OR($AF10=\"\",$AF10=0),0,(IF(TEXT($AF10,\"[hh]:mm:ss\")<TEXT($AE10,\"[hh]:mm:ss\"),(1-$AE10+$AF10),$AF10-$AE10))+IF(OR($AH10=\"\",$AH10=0),0,(IF(TEXT($AH10,\"[hh]:mm:ss\")<TEXT($AG10,\"[hh]:mm:ss\"),(1-$AG10+$AH10),$AH10-$AG10))+IF(OR($AJ10=\"\",$AJ10=0),0,(IF(TEXT($AJ10,\"[hh]:mm:ss\")<TEXT($AI10,\"[hh]:mm:ss\"),(1-$AI10+$AJ10),$AJ10-$AI10))))))","v":0},null,{"$f":"IF($C10=\"\",0,IF(Q10=\"Sim\",0,IF(TEXT(IF(OR((VLOOKUP($C10,$Z$8:$AB$15,3,FALSE)-$M10)<0,$AE10=\"\"),0,(VLOOKUP($C10,$Z$8:$AB$15,3,FALSE)-$M10)),\"[hh]:mm\")<=TEXT(rngTolerancia,\"[hh]:mm\"),0,IF(OR((VLOOKUP($C10,$Z$8:$AB$15,3,FALSE)-$M10)<0,$AE10=\"\"),0,(VLOOKUP($C10,$Z$8:$AB$15,3,FALSE)-$M10)))))","v":0},null,null,null,0,null,null,null,{"$f":"IF($C10=\"\",0,IF($S10<=VLOOKUP($C10,PREMISSAS!$C$6:$J$13,4,FALSE),$S10,VLOOKUP($C10,PREMISSAS!$C$6:$J$13,4,FALSE)))","v":0},null,{"$f":"IF($C10=\"\",0,IF($S10>VLOOKUP($C10,PREMISSAS!$C$6:$J$13,4,FALSE),$S10-VLOOKUP($C10,PREMISSAS!$C$6:$J$13,4,FALSE),0))","v":0},4,"QUARTA",0.33333333333333331,4,null,{"$f":"IF(OR(F10=\"\",F10=0,F10=\"FALTA\",F10=\"SUSPENSO\",F10=\"SUSPENSÃO\"),\"\",TEXT(F10,\"##\"\":\"\"##\"))","v":""},"","","","","",{"$f":"IF(OR(U10=\"\",U10=0,U10=\"FALTA\",U10=\"SUSPENSO\",U10=\"SUSPENSÃO\"),\"\",TEXT(TEXT(U10,\"00\"\":\"\"00\"),\"[hh]:mm\")*1)","v":""}]
[null,null,4,{"$f":"IF(D10=\"\",\"\",IF((D10+1)>'PERIODOS E FERIADOS'!$G$6,\"\",D10+1))","v":"2023-05-03"},"Quarta",null,null,null,null,null,null,null,0,null,0,null,null,null,0,null,null,null,{"$f":"IF($C11=\"\",0,IF($S11<=VLOOKUP($C11,PREMISSAS!$C$6:$J$13,4,FALSE),$S11,VLOOKUP($C11,PREMISSAS!$C$6:$J$13,4,FALSE)))","v":0},null,{"$f":"IF($C11=\"\",0,IF($S11>VLOOKUP($C11,PREMISSAS!$C$6:$J$13,4,FALSE),$S11-VLOOKUP($C11,PREMISSAS!$C$6:$J$13,4,FALSE),0))","v":0},5,"QUINTA",0.33333333333333331,5,null,"","","","","","",""]
[null,null,5,{"$f":"IF(D11=\"\",\"\",IF((D11+1)>'PERIODOS E FERIADOS'!$G$6,\"\",D11+1))","v":"2023-05-04"},"Quinta",null,null,null,null,null,null,null,0,null,0,null,null,null,0,null,null,null,{"$f":"IF($C12=\"\",0,IF($S12<=VLOOKUP($C12,PREMISSAS!$C$6:$J$13,4,FALSE),$S12,VLOOKUP($C12,PREMISSAS!$C$6:$J$13,4,FALSE)))","v":0},null,{"$f":"IF($C12=\"\",0,IF($S12>VLOOKUP($C12,PREMISSAS!$C$6:$J$13,4,FALSE),$S12-VLOOKUP($C12,PREMISSAS!$C$6:$J$13,4,FALSE),0))","v":0},6,"SEXTA",0.33333333333333331,6,null,"","","","","","",{"$f":"IF(OR(U12=\"\",U12=0,U12=\"FALTA\",U12=\"SUSPENSO\",U12=\"SUSPENSÃO\"),\"\",TEXT(TEXT(U12,\"##\"\":\"\"##\"),\"[hh]:mm\")*1)","v":""}]
[null,null,6,{"$f":"IF(D12=\"\",\"\",IF((D12+1)>'PERIODOS E FERIADOS'!$G$6,\"\",D12+1))","v":"2023-05-05"},"Sexta",null,null,null,null,null,null,null,0,null,0,null,null,null,0,null,null,null,{"$f":"IF($C13=\"\",0,IF($S13<=VLOOKUP($C13,PREMISSAS!$C$6:$J$13,4,FALSE),$S13,VLOOKUP($C13,PREMISSAS!$C$6:$J$13,4,FALSE)))","v":0},null,{"$f":"IF($C13=\"\",0,IF($S13>VLOOKUP($C13,PREMISSAS!$C$6:$J$13,4,FALSE),$S13-VLOOKUP($C13,PREMISSAS!$C$6:$J$13,4,FALSE),0))","v":0},7,"SÁBADO",0.16666666666666666,7,null,"","","","","","",""]
[null,null,7,{"$f":"IF(D13=\"\",\"\",IF((D13+1)>'PERIODOS E FERIADOS'!$G$6,\"\",D13+1))","v":"2023-05-06"},"Sábado",null,null,null,null,null,null,null,0,null,0,null,null,null,0,null,null,null,{"$f":"IF($C14=\"\",0,IF($S14<=VLOOKUP($C14,PREMISSAS!$C$6:$J$13,4,FALSE),$S14,VLOOKUP($C14,PREMISSAS!$C$6:$J$13,4,FALSE)))","v":0},null,{"$f":"IF($C14=\"\",0,IF($S14>VLOOKUP($C14,PREMISSAS!$C$6:$J$13,4,FALSE),$S14-VLOOKUP($C14,PREMISSAS!$C$6:$J$13,4,FALSE),0))","v":0},1,"DOMINGO",0,1,null,"","","","","","",""]
[null,null,1,{"$f":"IF(D14=\"\",\"\",IF((D14+1)>'PERIODOS E FERIADOS'!$G$6,\"\",D14+1))","v":"2023-05-07"},"Domingo",null,null,null,null,null,null,null,0,null,0,null,null,null,0,null,null,null,{"$f":"IF($C15=\"\",0,IF($S15<=VLOOKUP($C15,PREMISSAS!$C$6:$J$13,4,FALSE),$S15,VLOOKUP($C15,PREMISSAS!$C$6:$J$13,4,FALSE)))","v":0},null,{"$f":"IF($C15=\"\",0,IF($S15>VLOOKUP($C15,PREMISSAS!$C$6:$J$13,4,FALSE),$S15-VLOOKUP($C15,PREMISSAS!$C$6:$J$13,4,FALSE),0))","v":0},"F","FERIADOS",0,"F",null,"","","","","","",""]
[null,null,2,{"$f":"IF(D15=\"\",\"\",IF((D15+1)>'PERIODOS E FERIADOS'!$G$6,\"\",D15+1))","v":"2023-05-08"},"Segunda",null,null,null,null,null,null,null,0,null,0,null,null,null,0,null,null,null,{"$f":"IF($C16=\"\",0,IF($S16<=VLOOKUP($C16,PREMISSAS!$C$6:$J$13,4,FALSE),$S16,VLOOKUP($C16,PREMISSAS!$C$6:$J$13,4,FALSE)))","v":0},null,{"$f":"IF($C16=\"\",0,IF($S16>VLOOKUP($C16,PREMISSAS!$C$6:$J$13,4,FALSE),$S16-VLOOKUP($C16,PREMISSAS!$C$6:$J$13,4,FALSE),0))","v":0},null,"TOTAL SEMANA",{"$f":"SUM(AB8:AB15)","v":1.8333333333333333},null,null,"","","","","","",""]
[null,null,3,{"$f":"IF(D16=\"\",\"\",IF((D16+1)>'PERIODOS E FERIADOS'!$G$6,\"\",D16+1))","v":"2023-05-09"},"Terça",null,null,null,null,null,null,null,0,null,0,null,null,null,0,null,null,null,{"$f":"IF($C17=\"\",0,IF($S17<=VLOOKUP($C17,PREMISSAS!$C$6:$J$13,4,FALSE),$S17,VLOOKUP($C17,PREMISSAS!$C$6:$J$13,4,FALSE)))","v":0},null,{"$f":"IF($C17=\"\",0,IF($S17>VLOOKUP($C17,PREMISSAS!$C$6:$J$13,4,FALSE),$S17-VLOOKUP($C17,PREMISSAS!$C$6:$J$13,4,FALSE),0))","v":0},null,"JORNADA MENSAL",{"$f":"AB16*5","v":9.1666666666666661},null,null,"","","","","","",""]
[null,null,4,{"$f":"IF(D17=\"\",\"\",IF((D17+1)>'PERIODOS E FERIADOS'!$G$6,\"\",D17+1))","v":"2023-05-10"},"Quarta",null,null,null,null,null,null,null,0,null,0,null,null,null,0,null,null,null,{"$f":"IF($C18=\"\",0,IF($S18<=VLOOKUP($C18,PREMISSAS!$C$6:$J$13,4,FALSE),$S18,VLOOKUP($C18,PREMISSAS!$C$6:$J$13,4,FALSE)))","v":0},null,{"$f":"IF($C18=\"\",0,IF($S18>VLOOKUP($C18,PREMISSAS!$C$6:$J$13,4,FALSE),$S18-VLOOKUP($C18,PREMISSAS!$C$6:$J$13,4,FALSE),0))","v":0},null,null,null,null,null,"","","","","","",""]
[null,null,5,{"$f":"IF(D18=\"\",\"\",IF((D18+1)>'PERIODOS E FERIADOS'!$G$6,\"\",D18+1))","v":"2023-05-11"},"Quinta",null,null,null,null,null,null,null,0,null,0,null,null,null,0,null,null,null,{"$f":"IF($C19=\"\",0,IF($S19<=VLOOKUP($C19,PREMISSAS!$C$6:$J$13,4,FALSE),$S19,VLOOKUP($C19,PREMISSAS!$C$6:$J$13,4,FALSE)))","v":0},null,{"$f":"IF($C19=\"\",0,IF($S19>VLOOKUP($C19,PREMISSAS!$C$6:$J$13,4,FALSE),$S19-VLOOKUP($C19,PREMISSAS!$C$6:$J$13,4,FALSE),0))","v":0},null,{"$f":"IF(AB$16>AB$23,\"Jornada Superior a permitida\",IF(AB$16<=AB$23,\"\"))","v":""},null,null,null,"","","","","","",""]
[null,null,6,{"$f":"IF(D19=\"\",\"\",IF((D19+1)>'PERIODOS E FERIADOS'!$G$6,\"\",D19+1))","v":"2023-05-12"},"Sexta",null,null,null,null,null,null,null,0,null,0,null,null,null,0,null,null,null,{"$f":"IF($C20=\"\",0,IF($S20<=VLOOKUP($C20,PREMISSAS!$C$6:$J$13,4,FALSE),$S20,VLOOKUP($C20,PREMISSAS!$C$6:$J$13,4,FALSE)))","v":0},null,{"$f":"IF($C20=\"\",0,IF($S20>VLOOKUP($C20,PREMISSAS!$C$6:$J$13,4,FALSE),$S20-VLOOKUP($C20,PREMISSAS!$C$6:$J$13,4,FALSE),0))","v":0},null,{"$f":"IF(AB$16>AB$23,\"\",IF(AB$16<=AB$23,\"Jornada Ok\"))","v":"Jornada Ok"},null,null,null,"","","","","","",""]
[null,null,7,{"$f":"IF(D20=\"\",\"\",IF((D20+1)>'PERIODOS E FERIADOS'!$G$6,\"\",D20+1))","v":"2023-05-13"},"Sábado",null,null,null,null,null,null,null,0,null,0,null,null,null,0,null,null,null,{"$f":"IF($C21=\"\",0,IF($S21<=VLOOKUP($C21,PREMISSAS!$C$6:$J$13,4,FALSE),$S21,VLOOKUP($C21,PREMISSAS!$C$6:$J$13,4,FALSE)))","v":0},null,{"$f":"IF($C21=\"\",0,IF($S21>VLOOKUP($C21,PREMISSAS!$C$6:$J$13,4,FALSE),$S21-VLOOKUP($C21,PREMISSAS!$C$6:$J$13,4,FALSE),0))","v":0},null,null,null,null,null,"","","","","","",""]
[null,null,1,{"$f":"IF(D21=\"\",\"\",IF((D21+1)>'PERIODOS E FERIADOS'!$G$6,\"\",D21+1))","v":"2023-05-14"},"Domingo",null,null,null,null,null,null,null,0,null,0,null,null,null,0,null,null,null,{"$f":"IF($C22=\"\",0,IF($S22<=VLOOKUP($C22,PREMISSAS!$C$6:$J$13,4,FALSE),$S22,VLOOKUP($C22,PREMISSAS!$C$6:$J$13,4,FALSE)))","v":0},null,{"$f":"IF($C22=\"\",0,IF($S22>VLOOKUP($C22,PREMISSAS!$C$6:$J$13,4,FALSE),$S22-VLOOKUP($C22,PREMISSAS!$C$6:$J$13,4,FALSE),0))","v":0},null,null,null,null,null,"","","","","","",""]
[null,null,2,{"$f":"IF(D22=\"\",\"\",IF((D22+1)>'PERIODOS E FERIADOS'!$G$6,\"\",D22+1))","v":"2023-05-15"},"Segunda",null,null,null,null,null,null,null,0,null,0,null,null,null,0,null,null,null,{"$f":"IF($C23=\"\",0,IF($S23<=VLOOKUP($C23,PREMISSAS!$C$6:$J$13,4,FALSE),$S23,VLOOKUP($C23,PREMISSAS!$C$6:$J$13,4,FALSE)))","v":0},null,{"$f":"IF($C23=\"\",0,IF($S23>VLOOKUP($C23,PREMISSAS!$C$6:$J$13,4,FALSE),$S23-VLOOKUP($C23,PREMISSAS!$C$6:$J$13,4,FALSE),0))","v":0},null,"Jornada Maxima",1.8333333333333333,null,null,"","","","","","",""]
[null,null,3,{"$f":"IF(D23=\"\",\"\",IF((D23+1)>'PERIODOS E FERIADOS'!$G$6,\"\",D23+1))","v":"2023-05-16"},"Terça",null,null,null,null,null,null,null,0,null,0,null,null,null,0,null,null,null,{"$f":"IF($C24=\"\",0,IF($S24<=VLOOKUP($C24,PREMISSAS!$C$6:$J$13,4,FALSE),$S24,VLOOKUP($C24,PREMISSAS!$C$6:$J$13,4,FALSE)))","v":0},null,{"$f":"IF($C24=\"\",0,IF($S24>VLOOKUP($C24,PREMISSAS!$C$6:$J$13,4,FALSE),$S24-VLOOKUP($C24,PREMISSAS!$C$6:$J$13,4,FALSE),0))","v":0},null,null,null,null,null,"","","","","","",""]
[null,null,4,{"$f":"IF(D24=\"\",\"\",IF((D24+1)>'PERIODOS E FERIADOS'!$G$6,\"\",D24+1))","v":"2023-05-17"},"Quarta",null,null,null,null,null,null,null,0,null,0,null,null,null,0,null,null,null,{"$f":"IF($C25=\"\",0,IF($S25<=VLOOKUP($C25,PREMISSAS!$C$6:$J$13,4,FALSE),$S25,VLOOKUP($C25,PREMISSAS!$C$6:$J$13,4,FALSE)))","v":0},null,{"$f":"IF($C25=\"\",0,IF($S25>VLOOKUP($C25,PREMISSAS!$C$6:$J$13,4,FALSE),$S25-VLOOKUP($C25,PREMISSAS!$C$6:$J$13,4,FALSE),0))","v":0},null,null,null,null,null,"","","","","","",""]
[null,null,5,{"$f":"IF(D25=\"\",\"\",IF((D25+1)>'PERIODOS E FERIADOS'!$G$6,\"\",D25+1))","v":"2023-05-18"},"Quinta",null,null,null,null,null,null,null,0,null,0,null,null,null,0,null,null,null,{"$f":"IF($C26=\"\",0,IF($S26<=VLOOKUP($C26,PREMISSAS!$C$6:$J$13,4,FALSE),$S26,VLOOKUP($C26,PREMISSAS!$C$6:$J$13,4,FALSE)))","v":0},null,{"$f":"IF($C26=\"\",0,IF($S26>VLOOKUP($C26,PREMISSAS!$C$6:$J$13,4,FALSE),$S26-VLOOKUP($C26,PREMISSAS!$C$6:$J$13,4,FALSE),0))","v":0},null,null,null,null,null,"","","","","","",""]
[null,null,6,{"$f":"IF(D26=\"\",\"\",IF((D26+1)>'PERIODOS E FERIADOS'!$G$6,\"\",D26+1))","v":"2023-05-19"},"Sexta",null,null,null,null,null,null,null,0,null,0,null,null,null,0,null,null,null,{"$f":"IF($C27=\"\",0,IF($S27<=VLOOKUP($C27,PREMISSAS!$C$6:$J$13,4,FALSE),$S27,VLOOKUP($C27,PREMISSAS!$C$6:$J$13,4,FALSE)))","v":0},null,{"$f":"IF($C27=\"\",0,IF($S27>VLOOKUP($C27,PREMISSAS!$C$6:$J$13,4,FALSE),$S27-VLOOKUP($C27,PREMISSAS!$C$6:$J$13,4,FALSE),0))","v":0},null,null,null,null,null,"","","","","","",""]
[null,null,7,{"$f":"IF(D27=\"\",\"\",IF((D27+1)>'PERIODOS E FERIADOS'!$G$6,\"\",D27+1))","v":"2023-05-20"},"Sábado",null,null,null,null,null,null,null,0,null,0,null,null,null,0,null,null,null,{"$f":"IF($C28=\"\",0,IF($S28<=VLOOKUP($C28,PREMISSAS!$C$6:$J$13,4,FALSE),$S28,VLOOKUP($C28,PREMISSAS!$C$6:$J$13,4,FALSE)))","v":0},null,{"$f":"IF($C28=\"\",0,IF($S28>VLOOKUP($C28,PREMISSAS!$C$6:$J$13,4,FALSE),$S28-VLOOKUP($C28,PREMISSAS!$C$6:$J$13,4,FALSE),0))","v":0},null,null,null,null,null,"","","","","","",""]
[null,null,1,{"$f":"IF(D28=\"\",\"\",IF((D28+1)>'PERIODOS E FERIADOS'!$G$6,\"\",D28+1))","v":"2023-05-21"},"Domingo",null,null,null,null,null,null,null,0,null,0,null,null,null,0,null,null,null,{"$f":"IF($C29=\"\",0,IF($S29<=VLOOKUP($C29,PREMISSAS!$C$6:$J$13,4,FALSE),$S29,VLOOKUP($C29,PREMISSAS!$C$6:$J$13,4,FALSE)))","v":0},null,{"$f":"IF($C29=\"\",0,IF($S29>VLOOKUP($C29,PREMISSAS!$C$6:$J$13,4,FALSE),$S29-VLOOKUP($C29,PREMISSAS!$C$6:$J$13,4,FALSE),0))","v":0},null,null,null,null,null,"","","","","","",""]
[null,null,2,{"$f":"IF(D29=\"\",\"\",IF((D29+1)>'PERIODOS E FERIADOS'!$G$6,\"\",D29+1))","v":"2023-05-22"},"Segunda",null,null,null,null,null,null,null,0,null,0,null,null,null,0,null,null,null,{"$f":"IF($C30=\"\",0,IF($S30<=VLOOKUP($C30,PREMISSAS!$C$6:$J$13,4,FALSE),$S30,VLOOKUP($C30,PREMISSAS!$C$6:$J$13,4,FALSE)))","v":0},null,{"$f":"IF($C30=\"\",0,IF($S30>VLOOKUP($C30,PREMISSAS!$C$6:$J$13,4,FALSE),$S30-VLOOKUP($C30,PREMISSAS!$C$6:$J$13,4,FALSE),0))","v":0},null,null,null,null,null,"","","","","","",""]
[null,null,3,{"$f":"IF(D30=\"\",\"\",IF((D30+1)>'PERIODOS E FERIADOS'!$G$6,\"\",D30+1))","v":"2023-05-23"},"Terça",null,null,null,null,null,null,null,0,null,0,null,null,null,0,null,null,null,{"$f":"IF($C31=\"\",0,IF($S31<=VLOOKUP($C31,PREMISSAS!$C$6:$J$13,4,FALSE),$S31,VLOOKUP($C31,PREMISSAS!$C$6:$J$13,4,FALSE)))","v":0},null,{"$f":"IF($C31=\"\",0,IF($S31>VLOOKUP($C31,PREMISSAS!$C$6:$J$13,4,FALSE),$S31-VLOOKUP($C31,PREMISSAS!$C$6:$J$13,4,FALSE),0))","v":0},null,null,null,null,null,"","","","","","",""]
[null,null,4,{"$f":"IF(D31=\"\",\"\",IF((D31+1)>'PERIODOS E FERIADOS'!$G$6,\"\",D31+1))","v":"2023-05-24"},"Quarta",null,null,null,null,null,null,null,0,null,0,null,null,null,0,null,null,null,{"$f":"IF($C32=\"\",0,IF($S32<=VLOOKUP($C32,PREMISSAS!$C$6:$J$13,4,FALSE),$S32,VLOOKUP($C32,PREMISSAS!$C$6:$J$13,4,FALSE)))","v":0},null,{"$f":"IF($C32=\"\",0,IF($S32>VLOOKUP($C32,PREMISSAS!$C$6:$J$13,4,FALSE),$S32-VLOOKUP($C32,PREMISSAS!$C$6:$J$13,4,FALSE),0))","v":0},null,null,null,null,null,{"$f":"IF(OR(F32=\"\",F32=0,F32=\"FALTA\",F32=\"SUSPENSO\",F32=\"SUSPENSÃO\"),\"\",TEXT(F32,\"##\"\":\"\"##\"))","v":""},{"$f":"IF(OR(G32=\"\",G32=0,G32=\"FALTA\",G32=\"SUSPENSO\",G32=\"SUSPENSÃO\"),\"\",TEXT(G32,\"##\"\":\"\"##\"))","v":""},"","",{"$f":"IF(OR(J32=\"\",J32=0,J32=\"FALTA\",J32=\"SUSPENSO\",J32=\"SUSPENSÃO\"),\"\",TEXT(J32,\"##\"\":\"\"##\"))","v":""},{"$f":"IF(OR(K32=\"\",K32=0,K32=\"FALTA\",K32=\"SUSPENSO\",K32=\"SUSPENSÃO\"),\"\",TEXT(K32,\"##\"\":\"\"##\"))","v":""},""]
[null,null,5,{"$f":"IF(D32=\"\",\"\",IF((D32+1)>'PERIODOS E FERIADOS'!$G$6,\"\",D32+1))","v":"2023-05-25"},"Quinta",null,null,null,null,null,null,null,0,null,0,null,null,null,0,null,null,null,{"$f":"IF($C33=\"\",0,IF($S33<=VLOOKUP($C33,PREMISSAS!$C$6:$J$13,4,FALSE),$S33,VLOOKUP($C33,PREMISSAS!$C$6:$J$13,4,FALSE)))","v":0},null,{"$f":"IF($C33=\"\",0,IF($S33>VLOOKUP($C33,PREMISSAS!$C$6:$J$13,4,FALSE),$S33-VLOOKUP($C33,PREMISSAS!$C$6:$J$13,4,FALSE),0))","v":0},null,null,null,null,null,{"$f":"IF(OR(F33=\"\",F33=0,F33=\"FALTA\",F33=\"SUSPENSO\",F33=\"SUSPENSÃO\"),\"\",TEXT(F33,\"##\"\":\"\"##\"))","v":""},"","","","","",""]
[null,null,6,{"$f":"IF(D33=\"\",\"\",IF((D33+1)>'PERIODOS E FERIADOS'!$G$6,\"\",D33+1))","v":"2023-05-26"},"Sexta",null,null,null,null,null,null,null,0,null,0,null,null,null,0,null,null,null,{"$f":"IF($C34=\"\",0,IF($S34<=VLOOKUP($C34,PREMISSAS!$C$6:$J$13,4,FALSE),$S34,VLOOKUP($C34,PREMISSAS!$C$6:$J$13,4,FALSE)))","v":0},null,{"$f":"IF($C34=\"\",0,IF($S34>VLOOKUP($C34,PREMISSAS!$C$6:$J$13,4,FALSE),$S34-VLOOKUP($C34,PREMISSAS!$C$6:$J$13,4,FALSE),0))","v":0},null,null,null,null,null,"","","","","","",""]
[null,null,7,{"$f":"IF(D34=\"\",\"\",IF((D34+1)>'PERIODOS E FERIADOS'!$G$6,\"\",D34+1))","v":"2023-05-27"},"Sábado",null,null,null,null,null,null,null,0,null,0,null,null,null,0,null,null,null,{"$f":"IF($C35=\"\",0,IF($S35<=VLOOKUP($C35,PREMISSAS!$C$6:$J$13,4,FALSE),$S35,VLOOKUP($C35,PREMISSAS!$C$6:$J$13,4,FALSE)))","v":0},null,{"$f":"IF($C35=\"\",0,IF($S35>VLOOKUP($C35,PREMISSAS!$C$6:$J$13,4,FALSE),$S35-VLOOKUP($C35,PREMISSAS!$C$6:$J$13,4,FALSE),0))","v":0},null,null,null,null,null,"","","","","","",""]
[null,null,1,{"$f":"IF(D35=\"\",\"\",IF((D35+1)>'PERIODOS E FERIADOS'!$G$6,\"\",D35+1))","v":"2023-05-28"},"Domingo",null,null,null,null,null,null,null,0,null,0,null,null,null,0,null,null,null,{"$f":"IF($C36=\"\",0,IF($S36<=VLOOKUP($C36,PREMISSAS!$C$6:$J$13,4,FALSE),$S36,VLOOKUP($C36,PREMISSAS!$C$6:$J$13,4,FALSE)))","v":0},null,{"$f":"IF($C36=\"\",0,IF($S36>VLOOKUP($C36,PREMISSAS!$C$6:$J$13,4,FALSE),$S36-VLOOKUP($C36,PREMISSAS!$C$6:$J$13,4,FALSE),0))","v":0},null,null,null,null,null,"","","","","","",""]
[null,null,2,{"$f":"IF(D36=\"\",\"\",IF((D36+1)>'PERIODOS E FERIADOS'!$G$6,\"\",D36+1))","v":"2023-05-29"},"Segunda",null,null,null,null,null,null,null,0,null,0,null,null,null,0,null,null,null,{"$f":"IF($C37=\"\",0,IF($S37<=VLOOKUP($C37,PREMISSAS!$C$6:$J$13,4,FALSE),$S37,VLOOKUP($C37,PREMISSAS!$C$6:$J$13,4,FALSE)))","v":0},null,{"$f":"IF($C37=\"\",0,IF($S37>VLOOKUP($C37,PREMISSAS!$C$6:$J$13,4,FALSE),$S37-VLOOKUP($C37,PREMISSAS!$C$6:$J$13,4,FALSE),0))","v":0},null,null,null,null,null,"","","","","","",""]
[null,null,3,{"$f":"IF(D37=\"\",\"\",IF((D37+1)>'PERIODOS E FERIADOS'!$G$6,\"\",D37+1))","v":"2023-05-30"},"Terça",null,null,null,null,null,null,null,0,null,0,null,null,null,0,null,null,null,{"$f":"IF($C38=\"\",0,IF($S38<=VLOOKUP($C38,PREMISSAS!$C$6:$J$13,4,FALSE),$S38,VLOOKUP($C38,PREMISSAS!$C$6:$J$13,4,FALSE)))","v":0},null,{"$f":"IF($C38=\"\",0,IF($S38>VLOOKUP($C38,PREMISSAS!$C$6:$J$13,4,FALSE),$S38-VLOOKUP($C38,PREMISSAS!$C$6:$J$13,4,FALSE),0))","v":0},null,null,null,null,null,"","","","","","",""]
[null,null,4,{"$f":"IF(D38=\"\",\"\",IF((D38+1)>'PERIODOS E FERIADOS'!$G$6,\"\",D38+1))","v":"2023-05-31"},"Quarta",null,null,null,null,null,null,null,0,null,0,null,null,null,0,null,null,null,{"$f":"IF($C39=\"\",0,IF($S39<=VLOOKUP($C39,PREMISSAS!$C$6:$J$13,4,FALSE),$S39,VLOOKUP($C39,PREMISSAS!$C$6:$J$13,4,FALSE)))","v":0},null,{"$f":"IF($C39=\"\",0,IF($S39>VLOOKUP($C39,PREMISSAS!$C$6:$J$13,4,FALSE),$S39-VLOOKUP($C39,PREMISSAS!$C$6:$J$13,4,FALSE),0))","v":0},null,null,null,null,null,"","","","","","",""]
[]
[null,null,null,"TOTAIS",null,null,"Faltas / Suspensão",null,{"$f":"COUNTIF($F$9:$F$39,\"FALTA\")+COUNTIF($F$9:$F$39,\"SUSPENSÃO\")+COUNTIF($F$9:$F$39,\"SUSPENSO\")+COUNTIF($F$9:$F$39,\"SUSPENSAO\")","v":0},null,null,null,{"$f":"SUM($M$9:$M$39)","v":0},null,{"$f":"SUM($O$9:$O$39)","v":0},null,null,null,{"$f":"SUM(S$9:S$39)","v":0},null,{"$f":"$AK$41","v":0},null,{"$f":"SUM(W$9:W$39)","v":0},null,{"$f":"SUM(Y$9:Y$39)","v":0},null,null,null,null,null,null,null,null,null,null,null,{"$f":"SUM(AK9:AK39)","v":0}]
[]
[null,null,null,"OBSERVAÇÕES:"]

{"sheet":"FUNC 16","index":20,"n_rows":43,"n_cols":37,"rows_kept":43,"cut":false,"hidden":false,"merged":[[5,30,5,33],[40,3,40,5],[40,6,40,7],[40,8,40,10],[42,3,43,24],[18,26,18,27],[19,26,19,27],[3,3,4,27],[5,3,5,4],[5,5,5,10],[5,12,5,20],[5,22,5,24],[5,26,5,27]]}
[]
[]
[]
[null,null,null,{"$f":"'PERIODOS E FERIADOS'!$E$5","v":0}]
[]
[null,null,null,"Funcionário",null,{"$f":"FUNCIONÁRIOS!E20","v":16},null,null,null,null,null,null,"H.E. / Atrasos / A.N",null,null,null,null,null,null,null,null,null,"Distrib. H.E. p/ Faixa",null,null,null,"CARGA HORÁRIA",null,null,null,"ESPELHO"]
[]
[null,null,null,"Data","Dia Semana","Entrada","Saída","Entrada","Saída","Entrada","Saída",null,"H. Diária",null,"Atrasos",null,"Abona",null,"Horas Extras",null,"Adc. Noturno",null,{"$f":"PREMISSAS!H6","v":0.5},null,{"$f":"PREMISSAS!H12","v":1},2,"SEGUNDA",0.33333333333333331,2,null,"Entrada","Saída","Entrada","Saída","Entrada","Saída","AN "]
[null,null,{"$f":"IF(NOT(ISERROR(VLOOKUP(D9,rngFeriados,1,FALSE))),\"F\",IF(D9=\"\",\"\",WEEKDAY($D9,1)))","v":"F"},{"$f":"'PERIODOS E FERIADOS'!$E$6","v":"2023-05-01"},{"$f":"IF(D9=\"\",\"\",IF(WEEKDAY(D9,1)=1,\"Domingo\",IF(WEEKDAY(D9,1)=2,\"Segunda\",IF(WEEKDAY(D9,1)=3,\"Terça\",IF(WEEKDAY(D9,1)=4,\"Quarta\",IF(WEEKDAY(D9,1)=5,\"Quinta\",IF(WEEKDAY(D9,1)=6,\"Sexta\",IF(WEEKDAY(D9,1)=7,\"Sábado\"))))))))","v":"Segunda"},null,null,null,null,null,null,null,{"$f":"IF(ISERROR(IF(OR($AF9=\"\",$AF9=0),0,(IF(TEXT($AF9,\"[hh]:mm:ss\")<TEXT($AE9,\"[hh]:mm:ss\"),(1-$AE9+$AF9),$AF9-$AE9))+IF(OR($AH9=\"\",$AH9=0),0,(IF(TEXT($AH9,\"[hh]:mm:ss\")<TEXT($AG9,\"[hh]:mm:ss\"),(1-$AG9+$AH9),$AH9-$AG9))+IF(OR($AJ9=\"\",$AJ9=0),0,(IF(TEXT($AJ9,\"[hh]:mm:ss\")<TEXT($AI9,\"[hh]:mm:ss\"),(1-$AI9+$AJ9),$AJ9-$AI9)))))),0,IF(OR($AF9=\"\",$AF9=0),0,(IF(TEXT($AF9,\"[hh]:mm:ss\")<TEXT($AE9,\"[hh]:mm:ss\"),(1-$AE9+$AF9),$AF9-$AE9))+IF(OR($AH9=\"\",$AH9=0),0,(IF(TEXT($AH9,\"[hh]:mm:ss\")<TEXT($AG9,\"[hh]:mm:ss\"),(1-$AG9+$AH9),$AH9-$AG9))+IF(OR($AJ9=\"\",$AJ9=0),0,(IF(TEXT($AJ9,\"[hh]:mm:ss\")<TEXT($AI9,\"[hh]:mm:ss\"),(1-$AI9+$AJ9),$AJ9-$AI9))))))","v":0},null,{"$f":"IF($C9=\"\",0,IF(Q9=\"Sim\",0,IF(TEXT(IF(OR((VLOOKUP($C9,$Z$8:$AB$15,3,FALSE)-$M9)<0,$AE9=\"\"),0,(VLOOKUP($C9,$Z$8:$AB$15,3,FALSE)-$M9)),\"[hh]:mm\")<=TEXT(rngTolerancia,\"[hh]:mm\"),0,IF(OR((VLOOKUP($C9,$Z$8:$AB$15,3,FALSE)-$M9)<0,$AE9=\"\"),0,(VLOOKUP($C9,$Z$8:$AB$15,3,FALSE)-$M9)))))","v":0},null,null,null,{"$f":"IF($C9=\"\",0,IF(TEXT(IF(($M9-VLOOKUP($C9,$Z$8:$AB$15,3,FALSE))<0,0,($M9-VLOOKUP($C9,$Z$8:$AB$15,3,FALSE))),\"[hh]:mm\")<=TEXT(rngTolerancia,\"[hh]:mm\"),0,IF(($M9-VLOOKUP($C9,$Z$8:$AB$15,3,FALSE))<0,0,($M9-VLOOKUP($C9,$Z$8:$AB$15,3,FALSE)))))","v":0},null,null,null,{"$f":"IF($C9=\"\",0,IF($S9<=VLOOKUP($C9,PREMISSAS!$C$6:$J$13,4,FALSE),$S9,VLOOKUP($C9,PREMISSAS!$C$6:$J$13,4,FALSE)))","v":0},null,{"$f":"IF($C9=\"\",0,IF($S9>VLOOKUP($C9,PREMISSAS!$C$6:$J$13,4,FALSE),$S9-VLOOKUP($C9,PREMISSAS!$C$6:$J$13,4,FALSE),0))","v":0},3,"TERÇA",0.33333333333333331,3,null,{"$f":"IF(OR(F9=\"\",F9=0,F9=\"FALTA\",F9=\"SUSPENSO\",F9=\"SUSPENSÃO\"),\"\",TEXT(F9,\"##\"\":\"\"##\"))","v":""},{"$f":"IF(OR(G9=\"\",G9=0,G9=\"FALTA\",G9=\"SUSPENSO\",G9=\"SUSPENSÃO\"),\"\",TEXT(G9,\"##\"\":\"\"##\"))","v":""},"","",{"$f":"IF(OR(J9=\"\",J9=0,J9=\"FALTA\",J9=\"SUSPENSO\",J9=\"SUSPENSÃO\"),\"\",TEXT(J9,\"##\"\":\"\"##\"))","v":""},{"$f":"IF(OR(K9=\"\",K9=0,K9=\"FALTA\",K9=\"SUSPENSO\",K9=\"SUSPENSÃO\"),\"\",TEXT(K9,\"##\"\":\"\"##\"))","v":""},{"$f":"IF(OR(U9=\"\",U9=0,U9=\"FALTA\",U9=\"SUSPENSO\",U9=\"SUSPENSÃO\"),\"\",TEXT(TEXT(U9,\"00\"\":\"\"00\"),\"[hh]:mm\")*1)","v":""}]
[null,null,3,{"$f":"IF(D9=\"\",\"\",IF((D9+1)>'PERIODOS E FERIADOS'!$G$6,\"\",D9+1))","v":"2023-05-02"},{"$f":"IF(D10=\"\",\"\",IF(WEEKDAY(D10,1)=1,\"Domingo\",IF(WEEKDAY(D10,1)=2,\"Segunda\",IF(WEEKDAY(D10,1)=3,\"Terça\",IF(WEEKDAY(D10,1)=4,\"Quarta\",IF(WEEKDAY(D10,1)=5,\"Quinta\",IF(WEEKDAY(D10,1)=6,\"Sexta\",IF(WEEKDAY(D10,1)=7,\"Sábado\"))))))))","v":"Terça"},null,null,null,null,null,null,null,{"$f":"IF(ISERROR(IF(OR($AF10=\"\",$AF10=0),0,(IF(TEXT($AF10,\"[hh]:mm:ss\")<TEXT($AE10,\"[hh]:mm:ss\"),(1-$AE10+$AF10),$AF10-$AE10))+IF(OR($AH10=\"\",$AH10=0),0,(IF(TEXT($AH10,\"[hh]:mm:ss\")<TEXT($AG10,\"[hh]:mm:ss\"),(1-$AG10+$AH10),$AH10-$AG10))+IF(OR($AJ10=\"\",$AJ10=0),0,(IF(TEXT($AJ10,\"[hh]:mm:ss\")<TEXT($AI10,\"[hh]:mm:ss\"),(1-$AI10+$AJ10),$AJ10-$AI10)))))),0,IF(OR($AF10=\"\",$AF10=0),0,(IF(TEXT($AF10,\"[hh]:mm:ss\")<TEXT($AE10,\"[hh]:mm:ss\"),(1-$AE10+$AF10),$AF10-$AE10))+IF(OR($AH10=\"\",$AH10=0),0,(IF(TEXT($AH10,\"[hh]:mm:ss\")<TEXT($AG10,\"[hh]:mm:ss\"),(1-$AG10+$AH10),$AH10-$AG10))+IF(OR($AJ10=\"\",$AJ10=0),0,(IF(TEXT($AJ10,\"[hh]:mm:ss\")<TEXT($AI10,\"[hh]:mm:ss\"),(1-$AI10+$AJ10),$AJ10-$AI10))))))","v":0},null,{"$f":"IF($C10=\"\",0,IF(Q10=\"Sim\",0,IF(TEXT(IF(OR((VLOOKUP($C10,$Z$8:$AB$15,3,FALSE)-$M10)<0,$AE10=\"\"),0,(VLOOKUP($C10,$Z$8:$AB$15,3,FALSE)-$M10)),\"[hh]:mm\")<=TEXT(rngTolerancia,\"[hh]:mm\"),0,IF(OR((VLOOKUP($C10,$Z$8:$AB$15,3,FALSE)-$M10)<0,$AE10=\"\"),0,(VLOOKUP($C10,$Z$8:$AB$15,3,FALSE)-$M10)))))","v":0},null,null,null,0,null,null,null,{"$f":"IF($C10=\"\",0,IF($S10<=VLOOKUP($C10,PREMISSAS!$C$6:$J$13,4,FALSE),$S10,VLOOKUP($C10,PREMISSAS!$C$6:$J$13,4,FALSE)))","v":0},null,{"$f":"IF($C10=\"\",0,IF($S10>VLOOKUP($C10,PREMISSAS!$C$6:$J$13,4,FALSE),$S10-VLOOKUP($C10,PREMISSAS!$C$6:$J$13,4,FALSE),0))","v":0},4,"QUARTA",0.33333333333333331,4,null,{"$f":"IF(OR(F10=\"\",F10=0,F10=\"FALTA\",F10=\"SUSPENSO\",F10=\"SUSPENSÃO\"),\"\",TEXT(F10,\"##\"\":\"\"##\"))","v":""},"","","","","",{"$f":"IF(OR(U10=\"\",U10=0,U10=\"FALTA\",U10=\"SUSPENSO\",U10=\"SUSPENSÃO\"),\"\",TEXT(TEXT(U10,\"00\"\":\"\"00\"),\"[hh]:mm\")*1)","v":""}]
[null,null,4,{"$f":"IF(D10=\"\",\"\",IF((D10+1)>'PERIODOS E FERIADOS'!$G$6,\"\",D10+1))","v":"2023-05-03"},"Quarta",null,null,null,null,null,null,null,0,null,0,null,null,null,0,null,null,null,{"$f":"IF($C11=\"\",0,IF($S11<=VLOOKUP($C11,PREMISSAS!$C$6:$J$13,4,FALSE),$S11,VLOOKUP($C11,PREMISSAS!$C$6:$J$13,4,FALSE)))","v":0},null,{"$f":"IF($C11=\"\",0,IF($S11>VLOOKUP($C11,PREMISSAS!$C$6:$J$13,4,FALSE),$S11-VLOOKUP($C11,PREMISSAS!$C$6:$J$13,4,FALSE),0))","v":0},5,"QUINTA",0.33333333333333331,5,null,"","","","","","",""]
[null,null,5,{"$f":"IF(D11=\"\",\"\",IF((D11+1)>'PERIODOS E FERIADOS'!$G$6,\"\",D11+1))","v":"2023-05-04"},"Quinta",null,null,null,null,null,null,null,0,null,0,null,null,null,0,null,null,null,{"$f":"IF($C12=\"\",0,IF($S12<=VLOOKUP($C12,PREMISSAS!$C$6:$J$13,4,FALSE),$S12,VLOOKUP($C12,PREMISSAS!$C$6:$J$13,4,FALSE)))","v":0},null,{"$f":"IF($C12=\"\",0,IF($S12>VLOOKUP($C12,PREMISSAS!$C$6:$J$13,4,FALSE),$S12-VLOOKUP($C12,PREMISSAS!$C$6:$J$13,4,FALSE),0))","v":0},6,"SEXTA",0.33333333333333331,6,null,"","","","","","",{"$f":"IF(OR(U12=\"\",U12=0,U12=\"FALTA\",U12=\"SUSPENSO\",U12=\"SUSPENSÃO\"),\"\",TEXT(TEXT(U12,\"##\"\":\"\"##\"),\"[hh]:mm\")*1)","v":""}]
[null,null,6,{"$f":"IF(D12=\"\",\"\",IF((D12+1)>'PERIODOS E FERIADOS'!$G$6,\"\",D12+1))","v":"2023-05-05"},"Sexta",null,null,null,null,null,null,null,0,null,0,null,null,null,0,null,null,null,{"$f":"IF($C13=\"\",0,IF($S13<=VLOOKUP($C13,PREMISSAS!$C$6:$J$13,4,FALSE),$S13,VLOOKUP($C13,PREMISSAS!$C$6:$J$13,4,FALSE)))","v":0},null,{"$f":"IF($C13=\"\",0,IF($S13>VLOOKUP($C13,PREMISSAS!$C$6:$J$13,4,FALSE),$S13-VLOOKUP($C13,PREMISSAS!$C$6:$J$13,4,FALSE),0))","v":0},7,"SÁBADO",0.16666666666666666,7,null,"","","","","","",""]
[null,null,7,{"$f":"IF(D13=\"\",\"\",IF((D13+1)>'PERIODOS E FERIADOS'!$G$6,\"\",D13+1))","v":"2023-05-06"},"Sábado",null,null,null,null,null,null,null,0,null,0,null,null,null,0,null,null,null,{"$f":"IF($C14=\"\",0,IF($S14<=VLOOKUP($C14,PREMISSAS!$C$6:$J$13,4,FALSE),$S14,VLOOKUP($C14,PREMISSAS!$C$6:$J$13,4,FALSE)))","v":0},null,{"$f":"IF($C14=\"\",0,IF($S14>VLOOKUP($C14,PREMISSAS!$C$6:$J$13,4,FALSE),$S14-VLOOKUP($C14,PREMISSAS!$C$6:$J$13,4,FALSE),0))","v":0},1,"DOMINGO",0,1,null,"","","","","","",""]
[null,null,1,{"$f":"IF(D14=\"\",\"\",IF((D14+1)>'PERIODOS E FERIADOS'!$G$6,\"\",D14+1))","v":"2023-05-07"},"Domingo",null,null,null,null,null,null,null,0,null,0,null,null,null,0,null,null,null,{"$f":"IF($C15=\"\",0,IF($S15<=VLOOKUP($C15,PREMISSAS!$C$6:$J$13,4,FALSE),$S15,VLOOKUP($C15,PREMISSAS!$C$6:$J$13,4,FALSE)))","v":0},null,{"$f":"IF($C15=\"\",0,IF($S15>VLOOKUP($C15,PREMISSAS!$C$6:$J$13,4,FALSE),$S15-VLOOKUP($C15,PREMISSAS!$C$6:$J$13,4,FALSE),0))","v":0},"F","FERIADOS",0,"F",null,"","","","","","",""]
[null,null,2,{"$f":"IF(D15=\"\",\"\",IF((D15+1)>'PERIODOS E FERIADOS'!$G$6,\"\",D15+1))","v":"2023-05-08"},"Segunda",null,null,null,null,null,null,null,0,null,0,null,null,null,0,null,null,null,{"$f":"IF($C16=\"\",0,IF($S16<=VLOOKUP($C16,PREMISSAS!$C$6:$J$13,4,FALSE),$S16,VLOOKUP($C16,PREMISSAS!$C$6:$J$13,4,FALSE)))","v":0},null,{"$f":"IF($C16=\"\",0,IF($S16>VLOOKUP($C16,PREMISSAS!$C$6:$J$13,4,FALSE),$S16-VLOOKUP($C16,PREMISSAS!$C$6:$J$13,4,FALSE),0))","v":0},null,"TOTAL SEMANA",{"$f":"SUM(AB8:AB15)","v":1.8333333333333333},null,null,"","","","","","",""]
[null,null,3,{"$f":"IF(D16=\"\",\"\",IF((D16+1)>'PERIODOS E FERIADOS'!$G$6,\"\",D16+1))","v":"2023-05-09"},"Terça",null,null,null,null,null,null,null,0,null,0,null,null,null,0,null,null,null,{"$f":"IF($C17=\"\",0,IF($S17<=VLOOKUP($C17,PREMISSAS!$C$6:$J$13,4,FALSE),$S17,VLOOKUP($C17,PREMISSAS!$C$6:$J$13,4,FALSE)))","v":0},null,{"$f":"IF($C17=\"\",0,IF($S17>VLOOKUP($C17,PREMISSAS!$C$6:$J$13,4,FALSE),$S17-VLOOKUP($C17,PREMISSAS!$C$6:$J$13,4,FALSE),0))","v":0},null,"JORNADA MENSAL",{"$f":"AB16*5","v":9.1666666666666661},null,null,"","","","","","",""]
[null,null,4,{"$f":"IF(D17=\"\",\"\",IF((D17+1)>'PERIODOS E FERIADOS'!$G$6,\"\",D17+1))","v":"2023-05-10"},"Quarta",null,null,null,null,null,null,null,0,null,0,null,null,null,0,null,null,null,{"$f":"IF($C18=\"\",0,IF($S18<=VLOOKUP($C18,PREMISSAS!$C$6:$J$13,4,FALSE),$S18,VLOOKUP($C18,PREMISSAS!$C$6:$J$13,4,FALSE)))","v":0},null,{"$f":"IF($C18=\"\",0,IF($S18>VLOOKUP($C18,PREMISSAS!$C$6:$J$13,4,FALSE),$S18-VLOOKUP($C18,PREMISSAS!$C$6:$J$13,4,FALSE),0))","v":0},null,null,null,null,null,"","","","","","",""]
[null,null,5,{"$f":"IF(D18=\"\",\"\",IF((D18+1)>'PERIODOS E FERIADOS'!$G$6,\"\",D18+1))","v":"2023-05-11"},"Quinta",null,null,null,null,null,null,null,0,null,0,null,null,null,0,null,null,null,{"$f":"IF($C19=\"\",0,IF($S19<=VLOOKUP($C19,PREMISSAS!$C$6:$J$13,4,FALSE),$S19,VLOOKUP($C19,PREMISSAS!$C$6:$J$13,4,FALSE)))","v":0},null,{"$f":"IF($C19=\"\",0,IF($S19>VLOOKUP($C19,PREMISSAS!$C$6:$J$13,4,FALSE),$S19-VLOOKUP($C19,PREMISSAS!$C$6:$J$13,4,FALSE),0))","v":0},null,{"$f":"IF(AB$16>AB$23,\"Jornada Superior a permitida\",IF(AB$16<=AB$23,\"\"))","v":""},null,null,null,"","","","","","",""]
[null,null,6,{"$f":"IF(D19=\"\",\"\",IF((D19+1)>'PERIODOS E FERIADOS'!$G$6,\"\",D19+1))","v":"2023-05-12"},"Sexta",null,null,null,null,null,null,null,0,null,0,null,null,null,0,null,null,null,{"$f":"IF($C20=\"\",0,IF($S20<=VLOOKUP($C20,PREMISSAS!$C$6:$J$13,4,FALSE),$S20,VLOOKUP($C20,PREMISSAS!$C$6:$J$13,4,FALSE)))","v":0},null,{"$f":"IF($C20=\"\",0,IF($S20>VLOOKUP($C20,PREMISSAS!$C$6:$J$13,4,FALSE),$S20-VLOOKUP($C20,PREMISSAS!$C$6:$J$13,4,FALSE),0))","v":0},null,{"$f":"IF(AB$16>AB$23,\"\",IF(AB$16<=AB$23,\"Jornada Ok\"))","v":"Jornada Ok"},null,null,null,"","","","","","",""]
[null,null,7,{"$f":"IF(D20=\"\",\"\",IF((D20+1)>'PERIODOS E FERIADOS'!$G$6,\"\",D20+1))","v":"2023-05-13"},"Sábado",null,null,null,null,null,null,null,0,null,0,null,null,null,0,null,null,null,{"$f":"IF($C21=\"\",0,IF($S21<=VLOOKUP($C21,PREMISSAS!$C$6:$J$13,4,FALSE),$S21,VLOOKUP($C21,PREMISSAS!$C$6:$J$13,4,FALSE)))","v":0},null,{"$f":"IF($C21=\"\",0,IF($S21>VLOOKUP($C21,PREMISSAS!$C$6:$J$13,4,FALSE),$S21-VLOOKUP($C21,PREMISSAS!$C$6:$J$13,4,FALSE),0))","v":0},null,null,null,null,null,"","","","","","",""]
[null,null,1,{"$f":"IF(D21=\"\",\"\",IF((D21+1)>'PERIODOS E FERIADOS'!$G$6,\"\",D21+1))","v":"2023-05-14"},"Domingo",null,null,null,null,null,null,null,0,null,0,null,null,null,0,null,null,null,{"$f":"IF($C22=\"\",0,IF($S22<=VLOOKUP($C22,PREMISSAS!$C$6:$J$13,4,FALSE),$S22,VLOOKUP($C22,PREMISSAS!$C$6:$J$13,4,FALSE)))","v":0},null,{"$f":"IF($C22=\"\",0,IF($S22>VLOOKUP($C22,PREMISSAS!$C$6:$J$13,4,FALSE),$S22-VLOOKUP($C22,PREMISSAS!$C$6:$J$13,4,FALSE),0))","v":0},null,null,null,null,null,"","","","","","",""]
[null,null,2,{"$f":"IF(D22=\"\",\"\",IF((D22+1)>'PERIODOS E FERIADOS'!$G$6,\"\",D22+1))","v":"2023-05-15"},"Segunda",null,null,null,null,null,null,null,0,null,0,null,null,null,0,null,null,null,{"$f":"IF($C23=\"\",0,IF($S23<=VLOOKUP($C23,PREMISSAS!$C$6:$J$13,4,FALSE),$S23,VLOOKUP($C23,PREMISSAS!$C$6:$J$13,4,FALSE)))","v":0},null,{"$f":"IF($C23=\"\",0,IF($S23>VLOOKUP($C23,PREMISSAS!$C$6:$J$13,4,FALSE),$S23-VLOOKUP($C23,PREMISSAS!$C$6:$J$13,4,FALSE),0))","v":0},null,"Jornada Maxima",1.8333333333333333,null,null,"","","","","","",""]
[null,null,3,{"$f":"IF(D23=\"\",\"\",IF((D23+1)>'PERIODOS E FERIADOS'!$G$6,\"\",D23+1))","v":"2023-05-16"},"Terça",null,null,null,null,null,null,null,0,null,0,null,null,null,0,null,null,null,{"$f":"IF($C24=\"\",0,IF($S24<=VLOOKUP($C24,PREMISSAS!$C$6:$J$13,4,FALSE),$S24,VLOOKUP($C24,PREMISSAS!$C$6:$J$13,4,FALSE)))","v":0},null,{"$f":"IF($C24=\"\",0,IF($S24>VLOOKUP($C24,PREMISSAS!$C$6:$J$13,4,FALSE),$S24-VLOOKUP($C24,PREMISSAS!$C$6:$J$13,4,FALSE),0))","v":0},null,null,null,null,null,"","","","","","",""]
[null,null,4,{"$f":"IF(D24=\"\",\"\",IF((D24+1)>'PERIODOS E FERIADOS'!$G$6,\"\",D24+1))","v":"2023-05-17"},"Quarta",null,null,null,null,null,null,null,0,null,0,null,null,null,0,null,null,null,{"$f":"IF($C25=\"\",0,IF($S25<=VLOOKUP($C25,PREMISSAS!$C$6:$J$13,4,FALSE),$S25,VLOOKUP($C25,PREMISSAS!$C$6:$J$13,4,FALSE)))","v":0},null,{"$f":"IF($C25=\"\",0,IF($S25>VLOOKUP($C25,PREMISSAS!$C$6:$J$13,4,FALSE),$S25-VLOOKUP($C25,PREMISSAS!$C$6:$J$13,4,FALSE),0))","v":0},null,null,null,null,null,"","","","","","",""]
[null,null,5,{"$f":"IF(D25=\"\",\"\",IF((D25+1)>'PERIODOS E FERIADOS'!$G$6,\"\",D25+1))","v":"2023-05-18"},"Quinta",null,null,null,null,null,null,null,0,null,0,null,null,null,0,null,null,null,{"$f":"IF($C26=\"\",0,IF($S26<=VLOOKUP($C26,PREMISSAS!$C$6:$J$13,4,FALSE),$S26,VLOOKUP($C26,PREMISSAS!$C$6:$J$13,4,FALSE)))","v":0},null,{"$f":"IF($C26=\"\",0,IF($S26>VLOOKUP($C26,PREMISSAS!$C$6:$J$13,4,FALSE),$S26-VLOOKUP($C26,PREMISSAS!$C$6:$J$13,4,FALSE),0))","v":0},null,null,null,null,null,"","","","","","",""]
[null,null,6,{"$f":"IF(D26=\"\",\"\",IF((D26+1)>'PERIODOS E FERIADOS'!$G$6,\"\",D26+1))","v":"2023-05-19"},"Sexta",null,null,null,null,null,null,null,0,null,0,null,null,null,0,null,null,null,{"$f":"IF($C27=\"\",0,IF($S27<=VLOOKUP($C27,PREMISSAS!$C$6:$J$13,4,FALSE),$S27,VLOOKUP($C27,PREMISSAS!$C$6:$J$13,4,FALSE)))","v":0},null,{"$f":"IF($C27=\"\",0,IF($S27>VLOOKUP($C27,PREMISSAS!$C$6:$J$13,4,FALSE),$S27-VLOOKUP($C27,PREMISSAS!$C$6:$J$13,4,FALSE),0))","v":0},null,null,null,null,null,"","","","","","",""]
[null,null,7,{"$f":"IF(D27=\"\",\"\",IF((D27+1)>'PERIODOS E FERIADOS'!$G$6,\"\",D27+1))","v":"2023-05-20"},"Sábado",null,null,null,null,null,null,null,0,null,0,null,null,null,0,null,null,null,{"$f":"IF($C28=\"\",0,IF($S28<=VLOOKUP($C28,PREMISSAS!$C$6:$J$13,4,FALSE),$S28,VLOOKUP($C28,PREMISSAS!$C$6:$J$13,4,FALSE)))","v":0},null,{"$f":"IF($C28=\"\",0,IF($S28>VLOOKUP($C28,PREMISSAS!$C$6:$J$13,4,FALSE),$S28-VLOOKUP($C28,PREMISSAS!$C$6:$J$13,4,FALSE),0))","v":0},null,null,null,null,null,"","","","","","",""]
[null,null,1,{"$f":"IF(D28=\"\",\"\",IF((D28+1)>'PERIODOS E FERIADOS'!$G$6,\"\",D28+1))","v":"2023-05-21"},"Domingo",null,null,null,null,null,null,null,0,null,0,null,null,null,0,null,null,null,{"$f":"IF($C29=\"\",0,IF($S29<=VLOOKUP($C29,PREMISSAS!$C$6:$J$13,4,FALSE),$S29,VLOOKUP($C29,PREMISSAS!$C$6:$J$13,4,FALSE)))","v":0},null,{"$f":"IF($C29=\"\",0,IF($S29>VLOOKUP($C29,PREMISSAS!$C$6:$J$13,4,FALSE),$S29-VLOOKUP($C29,PREMISSAS!$C$6:$J$13,4,FALSE),0))","v":0},null,null,null,null,null,"","","","","","",""]
[null,null,2,{"$f":"IF(D29=\"\",\"\",IF((D29+1)>'PERIODOS E FERIADOS'!$G$6,\"\",D29+1))","v":"2023-05-22"},"Segunda",null,null,null,null,null,null,null,0,null,0,null,null,null,0,null,null,null,{"$f":"IF($C30=\"\",0,IF($S30<=VLOOKUP($C30,PREMISSAS!$C$6:$J$13,4,FALSE),$S30,VLOOKUP($C30,PREMISSAS!$C$6:$J$13,4,FALSE)))","v":0},null,{"$f":"IF($C30=\"\",0,IF($S30>VLOOKUP($C30,PREMISSAS!$C$6:$J$13,4,FALSE),$S30-VLOOKUP($C30,PREMISSAS!$C$6:$J$13,4,FALSE),0))","v":0},null,null,null,null,null,"","","","","","",""]
[null,null,3,{"$f":"IF(D30=\"\",\"\",IF((D30+1)>'PERIODOS E FERIADOS'!$G$6,\"\",D30+1))","v":"2023-05-23"},"Terça",null,null,null,null,null,null,null,0,null,0,null,null,null,0,null,null,null,{"$f":"IF($C31=\"\",0,IF($S31<=VLOOKUP($C31,PREMISSAS!$C$6:$J$13,4,FALSE),$S31,VLOOKUP($C31,PREMISSAS!$C$6:$J$13,4,FALSE)))","v":0},null,{"$f":"IF($C31=\"\",0,IF($S31>VLOOKUP($C31,PREMISSAS!$C$6:$J$13,4,FALSE),$S31-VLOOKUP($C31,PREMISSAS!$C$6:$J$13,4,FALSE),0))","v":0},null,null,null,null,null,"","","","","","",""]
[null,null,4,{"$f":"IF(D31=\"\",\"\",IF((D31+1)>'PERIODOS E FERIADOS'!$G$6,\"\",D31+1))","v":"2023-05-24"},"Quarta",null,null,null,null,null,null,null,0,null,0,null,null,null,0,null,null,null,{"$f":"IF($C32=\"\",0,IF($S32<=VLOOKUP($C32,PREMISSAS!$C$6:$J$13,4,FALSE),$S32,VLOOKUP($C32,PREMISSAS!$C$6:$J$13,4,FALSE)))","v":0},null,{"$f":"IF($C32=\"\",0,IF($S32>VLOOKUP($C32,PREMISSAS!$C$6:$J$13,4,FALSE),$S32-VLOOKUP($C32,PREMISSAS!$C$6:$J$13,4,FALSE),0))","v":0},null,null,null,null,null,{"$f":"IF(OR(F32=\"\",F32=0,F32=\"FALTA\",F32=\"SUSPENSO\",F32=\"SUSPENSÃO\"),\"\",TEXT(F32,\"##\"\":\"\"##\"))","v":""},{"$f":"IF(OR(G32=\"\",G32=0,G32=\"FALTA\",G32=\"SUSPENSO\",G32=\"SUSPENSÃO\"),\"\",TEXT(G32,\"##\"\":\"\"##\"))","v":""},"","",{"$f":"IF(OR(J32=\"\",J32=0,J32=\"FALTA\",J32=\"SUSPENSO\",J32=\"SUSPENSÃO\"),\"\",TEXT(J32,\"##\"\":\"\"##\"))","v":""},{"$f":"IF(OR(K32=\"\",K32=0,K32=\"FALTA\",K32=\"SUSPENSO\",K32=\"SUSPENSÃO\"),\"\",TEXT(K32,\"##\"\":\"\"##\"))","v":""},""]
[null,null,5,{"$f":"IF(D32=\"\",\"\",IF((D32+1)>'PERIODOS E FERIADOS'!$G$6,\"\",D32+1))","v":"2023-05-25"},"Quinta",null,null,null,null,null,null,null,0,null,0,null,null,null,0,null,null,null,{"$f":"IF($C33=\"\",0,IF($S33<=VLOOKUP($C33,PREMISSAS!$C$6:$J$13,4,FALSE),$S33,VLOOKUP($C33,PREMISSAS!$C$6:$J$13,4,FALSE)))","v":0},null,{"$f":"IF($C33=\"\",0,IF($S33>VLOOKUP($C33,PREMISSAS!$C$6:$J$13,4,FALSE),$S33-VLOOKUP($C33,PREMISSAS!$C$6:$J$13,4,FALSE),0))","v":0},null,null,null,null,null,{"$f":"IF(OR(F33=\"\",F33=0,F33=\"FALTA\",F33=\"SUSPENSO\",F33=\"SUSPENSÃO\"),\"\",TEXT(F33,\"##\"\":\"\"##\"))","v":""},"","","","","",""]
[null,null,6,{"$f":"IF(D33=\"\",\"\",IF((D33+1)>'PERIODOS E FERIADOS'!$G$6,\"\",D33+1))","v":"2023-05-26"},"Sexta",null,null,null,null,null,null,null,0,null,0,null,null,null,0,null,null,null,{"$f":"IF($C34=\"\",0,IF($S34<=VLOOKUP($C34,PREMISSAS!$C$6:$J$13,4,FALSE),$S34,VLOOKUP($C34,PREMISSAS!$C$6:$J$13,4,FALSE)))","v":0},null,{"$f":"IF($C34=\"\",0,IF($S34>VLOOKUP($C34,PREMISSAS!$C$6:$J$13,4,FALSE),$S34-VLOOKUP($C34,PREMISSAS!$C$6:$J$13,4,FALSE),0))","v":0},null,null,null,null,null,"","","","","","",""]
[null,null,7,{"$f":"IF(D34=\"\",\"\",IF((D34+1)>'PERIODOS E FERIADOS'!$G$6,\"\",D34+1))","v":"2023-05-27"},"Sábado",null,null,null,null,null,null,null,0,null,0,null,null,null,0,null,null,null,{"$f":"IF($C35=\"\",0,IF($S35<=VLOOKUP($C35,PREMISSAS!$C$6:$J$13,4,FALSE),$S35,VLOOKUP($C35,PREMISSAS!$C$6:$J$13,4,FALSE)))","v":0},null,{"$f":"IF($C35=\"\",0,IF($S35>VLOOKUP($C35,PREMISSAS!$C$6:$J$13,4,FALSE),$S35-VLOOKUP($C35,PREMISSAS!$C$6:$J$13,4,FALSE),0))","v":0},null,null,null,null,null,"","","","","","",""]
[null,null,1,{"$f":"IF(D35=\"\",\"\",IF((D35+1)>'PERIODOS E FERIADOS'!$G$6,\"\",D35+1))","v":"2023-05-28"},"Domingo",null,null,null,null,null,null,null,0,null,0,null,null,null,0,null,null,null,{"$f":"IF($C36=\"\",0,IF($S36<=VLOOKUP($C36,PREMISSAS!$C$6:$J$13,4,FALSE),$S36,VLOOKUP($C36,PREMISSAS!$C$6:$J$13,4,FALSE)))","v":0},null,{"$f":"IF($C36=\"\",0,IF($S36>VLOOKUP($C36,PREMISSAS!$C$6:$J$13,4,FALSE),$S36-VLOOKUP($C36,PREMISSAS!$C$6:$J$13,4,FALSE),0))","v":0},null,null,null,null,null,"","","","","","",""]
[null,null,2,{"$f":"IF(D36=\"\",\"\",IF((D36+1)>'PERIODOS E FERIADOS'!$G$6,\"\",D36+1))","v":"2023-05-29"},"Segunda",null,null,null,null,null,null,null,0,null,0,null,null,null,0,null,null,null,{"$f":"IF($C37=\"\",0,IF($S37<=VLOOKUP($C37,PREMISSAS!$C$6:$J$13,4,FALSE),$S37,VLOOKUP($C37,PREMISSAS!$C$6:$J$13,4,FALSE)))","v":0},null,{"$f":"IF($C37=\"\",0,IF($S37>VLOOKUP($C37,PREMISSAS!$C$6:$J$13,4,FALSE),$S37-VLOOKUP($C37,PREMISSAS!$C$6:$J$13,4,FALSE),0))","v":0},null,null,null,null,null,"","","","","","",""]
[null,null,3,{"$f":"IF(D37=\"\",\"\",IF((D37+1)>'PERIODOS E FERIADOS'!$G$6,\"\",D37+1))","v":"2023-05-30"},"Terça",null,null,null,null,null,null,null,0,null,0,null,null,null,0,null,null,null,{"$f":"IF($C38=\"\",0,IF($S38<=VLOOKUP($C38,PREMISSAS!$C$6:$J$13,4,FALSE),$S38,VLOOKUP($C38,PREMISSAS!$C$6:$J$13,4,FALSE)))","v":0},null,{"$f":"IF($C38=\"\",0,IF($S38>VLOOKUP($C38,PREMISSAS!$C$6:$J$13,4,FALSE),$S38-VLOOKUP($C38,PREMISSAS!$C$6:$J$13,4,FALSE),0))","v":0},null,null,null,null,null,"","","","","","",""]
[null,null,4,{"$f":"IF(D38=\"\",\"\",IF((D38+1)>'PERIODOS E FERIADOS'!$G$6,\"\",D38+1))","v":"2023-05-31"},"Quarta",null,null,null,null,null,null,null,0,null,0,null,null,null,0,null,null,null,{"$f":"IF($C39=\"\",0,IF($S39<=VLOOKUP($C39,PREMISSAS!$C$6:$J$13,4,FALSE),$S39,VLOOKUP($C39,PREMISSAS!$C$6:$J$13,4,FALSE)))","v":0},null,{"$f":"IF($C39=\"\",0,IF($S39>VLOOKUP($C39,PREMISSAS!$C$6:$J$13,4,FALSE),$S39-VLOOKUP($C39,PREMISSAS!$C$6:$J$13,4,FALSE),0))","v":0},null,null,null,null,null,"","","","","","",""]
[]
[null,null,null,"TOTAIS",null,null,"Faltas / Suspensão",null,{"$f":"COUNTIF($F$9:$F$39,\"FALTA\")+COUNTIF($F$9:$F$39,\"SUSPENSÃO\")+COUNTIF($F$9:$F$39,\"SUSPENSO\")+COUNTIF($F$9:$F$39,\"SUSPENSAO\")","v":0},null,null,null,{"$f":"SUM($M$9:$M$39)","v":0},null,{"$f":"SUM($O$9:$O$39)","v":0},null,null,null,{"$f":"SUM(S$9:S$39)","v":0},null,{"$f":"$AK$41","v":0},null,{"$f":"SUM(W$9:W$39)","v":0},null,{"$f":"SUM(Y$9:Y$39)","v":0},null,null,null,null,null,null,null,null,null,null,null,{"$f":"SUM(AK9:AK39)","v":0}]
[]
[null,null,null,"OBSERVAÇÕES:"]

{"sheet":"FUNC 17","index":21,"n_rows":43,"n_cols":37,"rows_kept":43,"cut":false,"hidden":false,"merged":[[5,30,5,33],[40,3,40,5],[40,6,40,7],[40,8,40,10],[42,3,43,24],[18,26,18,27],[19,26,19,27],[3,3,4,27],[5,3,5,4],[5,5,5,10],[5,12,5,20],[5,22,5,24],[5,26,5,27]]}
[]
[]
[]
[null,null,null,{"$f":"'PERIODOS E FERIADOS'!$E$5","v":0}]
[]
[null,null,null,"Funcionário",null,{"$f":"FUNCIONÁRIOS!E21","v":17},null,null,null,null,null,null,"H.E. / Atrasos / A.N",null,null,null,null,null,null,null,null,null,"Distrib. H.E. p/ Faixa",null,null,null,"CARGA HORÁRIA",null,null,null,"ESPELHO"]
[]
[null,null,null,"Data","Dia Semana","Entrada","Saída","Entrada","Saída","Entrada","Saída",null,"H. Diária",null,"Atrasos",null,"Abona",null,"Horas Extras",null,"Adc. Noturno",null,{"$f":"PREMISSAS!H6","v":0.5},null,{"$f":"PREMISSAS!H12","v":1},2,"SEGUNDA",0.33333333333333331,2,null,"Entrada","Saída","Entrada","Saída","Entrada","Saída","AN "]
[null,null,{"$f":"IF(NOT(ISERROR(VLOOKUP(D9,rngFeriados,1,FALSE))),\"F\",IF(D9=\"\",\"\",WEEKDAY($D9,1)))","v":"F"},{"$f":"'PERIODOS E FERIADOS'!$E$6","v":"2023-05-01"},{"$f":"IF(D9=\"\",\"\",IF(WEEKDAY(D9,1)=1,\"Domingo\",IF(WEEKDAY(D9,1)=2,\"Segunda\",IF(WEEKDAY(D9,1)=3,\"Terça\",IF(WEEKDAY(D9,1)=4,\"Quarta\",IF(WEEKDAY(D9,1)=5,\"Quinta\",IF(WEEKDAY(D9,1)=6,\"Sexta\",IF(WEEKDAY(D9,1)=7,\"Sábado\"))))))))","v":"Segunda"},null,null,null,null,null,null,null,{"$f":"IF(ISERROR(IF(OR($AF9=\"\",$AF9=0),0,(IF(TEXT($AF9,\"[hh]:mm:ss\")<TEXT($AE9,\"[hh]:mm:ss\"),(1-$AE9+$AF9),$AF9-$AE9))+IF(OR($AH9=\"\",$AH9=0),0,(IF(TEXT($AH9,\"[hh]:mm:ss\")<TEXT($AG9,\"[hh]:mm:ss\"),(1-$AG9+$AH9),$AH9-$AG9))+IF(OR($AJ9=\"\",$AJ9=0),0,(IF(TEXT($AJ9,\"[hh]:mm:ss\")<TEXT($AI9,\"[hh]:mm:ss\"),(1-$AI9+$AJ9),$AJ9-$AI9)))))),0,IF(OR($AF9=\"\",$AF9=0),0,(IF(TEXT($AF9,\"[hh]:mm:ss\")<TEXT($AE9,\"[hh]:mm:ss\"),(1-$AE9+$AF9),$AF9-$AE9))+IF(OR($AH9=\"\",$AH9=0),0,(IF(TEXT($AH9,\"[hh]:mm:ss\")<TEXT($AG9,\"[hh]:mm:ss\"),(1-$AG9+$AH9),$AH9-$AG9))+IF(OR($AJ9=\"\",$AJ9=0),0,(IF(TEXT($AJ9,\"[hh]:mm:ss\")<TEXT($AI9,\"[hh]:mm:ss\"),(1-$AI9+$AJ9),$AJ9-$AI9))))))","v":0},null,{"$f":"IF($C9=\"\",0,IF(Q9=\"Sim\",0,IF(TEXT(IF(OR((VLOOKUP($C9,$Z$8:$AB$15,3,FALSE)-$M9)<0,$AE9=\"\"),0,(VLOOKUP($C9,$Z$8:$AB$15,3,FALSE)-$M9)),\"[hh]:mm\")<=TEXT(rngTolerancia,\"[hh]:mm\"),0,IF(OR((VLOOKUP($C9,$Z$8:$AB$15,3,FALSE)-$M9)<0,$AE9=\"\"),0,(VLOOKUP($C9,$Z$8:$AB$15,3,FALSE)-$M9)))))","v":0},null,null,null,{"$f":"IF($C9=\"\",0,IF(TEXT(IF(($M9-VLOOKUP($C9,$Z$8:$AB$15,3,FALSE))<0,0,($M9-VLOOKUP($C9,$Z$8:$AB$15,3,FALSE))),\"[hh]:mm\")<=TEXT(rngTolerancia,\"[hh]:mm\"),0,IF(($M9-VLOOKUP($C9,$Z$8:$AB$15,3,FALSE))<0,0,($M9-VLOOKUP($C9,$Z$8:$AB$15,3,FALSE)))))","v":0},null,null,null,{"$f":"IF($C9=\"\",0,IF($S9<=VLOOKUP($C9,PREMISSAS!$C$6:$J$13,4,FALSE),$S9,VLOOKUP($C9,PREMISSAS!$C$6:$J$13,4,FALSE)))","v":0},null,{"$f":"IF($C9=\"\",0,IF($S9>VLOOKUP($C9,PREMISSAS!$C$6:$J$13,4,FALSE),$S9-VLOOKUP($C9,PREMISSAS!$C$6:$J$13,4,FALSE),0))","v":0},3,"TERÇA",0.33333333333333331,3,null,{"$f":"IF(OR(F9=\"\",F9=0,F9=\"FALTA\",F9=\"SUSPENSO\",F9=\"SUSPENSÃO\"),\"\",TEXT(F9,\"##\"\":\"\"##\"))","v":""},{"$f":"IF(OR(G9=\"\",G9=0,G9=\"FALTA\",G9=\"SUSPENSO\",G9=\"SUSPENSÃO\"),\"\",TEXT(G9,\"##\"\":\"\"##\"))","v":""},"","",{"$f":"IF(OR(J9=\"\",J9=0,J9=\"FALTA\",J9=\"SUSPENSO\",J9=\"SUSPENSÃO\"),\"\",TEXT(J9,\"##\"\":\"\"##\"))","v":""},{"$f":"IF(OR(K9=\"\",K9=0,K9=\"FALTA\",K9=\"SUSPENSO\",K9=\"SUSPENSÃO\"),\"\",TEXT(K9,\"##\"\":\"\"##\"))","v":""},{"$f":"IF(OR(U9=\"\",U9=0,U9=\"FALTA\",U9=\"SUSPENSO\",U9=\"SUSPENSÃO\"),\"\",TEXT(TEXT(U9,\"00\"\":\"\"00\"),\"[hh]:mm\")*1)","v":""}]
[null,null,3,{"$f":"IF(D9=\"\",\"\",IF((D9+1)>'PERIODOS E FERIADOS'!$G$6,\"\",D9+1))","v":"2023-05-02"},{"$f":"IF(D10=\"\",\"\",IF(WEEKDAY(D10,1)=1,\"Domingo\",IF(WEEKDAY(D10,1)=2,\"Segunda\",IF(WEEKDAY(D10,1)=3,\"Terça\",IF(WEEKDAY(D10,1)=4,\"Quarta\",IF(WEEKDAY(D10,1)=5,\"Quinta\",IF(WEEKDAY(D10,1)=6,\"Sexta\",IF(WEEKDAY(D10,1)=7,\"Sábado\"))))))))","v":"Terça"},null,null,null,null,null,null,null,{"$f":"IF(ISERROR(IF(OR($AF10=\"\",$AF10=0),0,(IF(TEXT($AF10,\"[hh]:mm:ss\")<TEXT($AE10,\"[hh]:mm:ss\"),(1-$AE10+$AF10),$AF10-$AE10))+IF(OR($AH10=\"\",$AH10=0),0,(IF(TEXT($AH10,\"[hh]:mm:ss\")<TEXT($AG10,\"[hh]:mm:ss\"),(1-$AG10+$AH10),$AH10-$AG10))+IF(OR($AJ10=\"\",$AJ10=0),0,(IF(TEXT($AJ10,\"[hh]:mm:ss\")<TEXT($AI10,\"[hh]:mm:ss\"),(1-$AI10+$AJ10),$AJ10-$AI10)))))),0,IF(OR($AF10=\"\",$AF10=0),0,(IF(TEXT($AF10,\"[hh]:mm:ss\")<TEXT($AE10,\"[hh]:mm:ss\"),(1-$AE10+$AF10),$AF10-$AE10))+IF(OR($AH10=\"\",$AH10=0),0,(IF(TEXT($AH10,\"[hh]:mm:ss\")<TEXT($AG10,\"[hh]:mm:ss\"),(1-$AG10+$AH10),$AH10-$AG10))+IF(OR($AJ10=\"\",$AJ10=0),0,(IF(TEXT($AJ10,\"[hh]:mm:ss\")<TEXT($AI10,\"[hh]:mm:ss\"),(1-$AI10+$AJ10),$AJ10-$AI10))))))","v":0},null,{"$f":"IF($C10=\"\",0,IF(Q10=\"Sim\",0,IF(TEXT(IF(OR((VLOOKUP($C10,$Z$8:$AB$15,3,FALSE)-$M10)<0,$AE10=\"\"),0,(VLOOKUP($C10,$Z$8:$AB$15,3,FALSE)-$M10)),\"[hh]:mm\")<=TEXT(rngTolerancia,\"[hh]:mm\"),0,IF(OR((VLOOKUP($C10,$Z$8:$AB$15,3,FALSE)-$M10)<0,$AE10=\"\"),0,(VLOOKUP($C10,$Z$8:$AB$15,3,FALSE)-$M10)))))","v":0},null,null,null,0,null,null,null,{"$f":"IF($C10=\"\",0,IF($S10<=VLOOKUP($C10,PREMISSAS!$C$6:$J$13,4,FALSE),$S10,VLOOKUP($C10,PREMISSAS!$C$6:$J$13,4,FALSE)))","v":0},null,{"$f":"IF($C10=\"\",0,IF($S10>VLOOKUP($C10,PREMISSAS!$C$6:$J$13,4,FALSE),$S10-VLOOKUP($C10,PREMISSAS!$C$6:$J$13,4,FALSE),0))","v":0},4,"QUARTA",0.33333333333333331,4,null,{"$f":"IF(OR(F10=\"\",F10=0,F10=\"FALTA\",F10=\"SUSPENSO\",F10=\"SUSPENSÃO\"),\"\",TEXT(F10,\"##\"\":\"\"##\"))","v":""},"","","","","",{"$f":"IF(OR(U10=\"\",U10=0,U10=\"FALTA\",U10=\"SUSPENSO\",U10=\"SUSPENSÃO\"),\"\",TEXT(TEXT(U10,\"00\"\":\"\"00\"),\"[hh]:mm\")*1)","v":""}]
[null,null,4,{"$f":"IF(D10=\"\",\"\",IF((D10+1)>'PERIODOS E FERIADOS'!$G$6,\"\",D10+1))","v":"2023-05-03"},"Quarta",null,null,null,null,null,null,null,0,null,0,null,null,null,0,null,null,null,{"$f":"IF($C11=\"\",0,IF($S11<=VLOOKUP($C11,PREMISSAS!$C$6:$J$13,4,FALSE),$S11,VLOOKUP($C11,PREMISSAS!$C$6:$J$13,4,FALSE)))","v":0},null,{"$f":"IF($C11=\"\",0,IF($S11>VLOOKUP($C11,PREMISSAS!$C$6:$J$13,4,FALSE),$S11-VLOOKUP($C11,PREMISSAS!$C$6:$J$13,4,FALSE),0))","v":0},5,"QUINTA",0.33333333333333331,5,null,"","","","","","",""]
[null,null,5,{"$f":"IF(D11=\"\",\"\",IF((D11+1)>'PERIODOS E FERIADOS'!$G$6,\"\",D11+1))","v":"2023-05-04"},"Quinta",null,null,null,null,null,null,null,0,null,0,null,null,null,0,null,null,null,{"$f":"IF($C12=\"\",0,IF($S12<=VLOOKUP($C12,PREMISSAS!$C$6:$J$13,4,FALSE),$S12,VLOOKUP($C12,PREMISSAS!$C$6:$J$13,4,FALSE)))","v":0},null,{"$f":"IF($C12=\"\",0,IF($S12>VLOOKUP($C12,PREMISSAS!$C$6:$J$13,4,FALSE),$S12-VLOOKUP($C12,PREMISSAS!$C$6:$J$13,4,FALSE),0))","v":0},6,"SEXTA",0.33333333333333331,6,null,"","","","","","",{"$f":"IF(OR(U12=\"\",U12=0,U12=\"FALTA\",U12=\"SUSPENSO\",U12=\"SUSPENSÃO\"),\"\",TEXT(TEXT(U12,\"##\"\":\"\"##\"),\"[hh]:mm\")*1)","v":""}]
[null,null,6,{"$f":"IF(D12=\"\",\"\",IF((D12+1)>'PERIODOS E FERIADOS'!$G$6,\"\",D12+1))","v":"2023-05-05"},"Sexta",null,null,null,null,null,null,null,0,null,0,null,null,null,0,null,null,null,{"$f":"IF($C13=\"\",0,IF($S13<=VLOOKUP($C13,PREMISSAS!$C$6:$J$13,4,FALSE),$S13,VLOOKUP($C13,PREMISSAS!$C$6:$J$13,4,FALSE)))","v":0},null,{"$f":"IF($C13=\"\",0,IF($S13>VLOOKUP($C13,PREMISSAS!$C$6:$J$13,4,FALSE),$S13-VLOOKUP($C13,PREMISSAS!$C$6:$J$13,4,FALSE),0))","v":0},7,"SÁBADO",0.16666666666666666,7,null,"","","","","","",""]
[null,null,7,{"$f":"IF(D13=\"\",\"\",IF((D13+1)>'PERIODOS E FERIADOS'!$G$6,\"\",D13+1))","v":"2023-05-06"},"Sábado",null,null,null,null,null,null,null,0,null,0,null,null,null,0,null,null,null,{"$f":"IF($C14=\"\",0,IF($S14<=VLOOKUP($C14,PREMISSAS!$C$6:$J$13,4,FALSE),$S14,VLOOKUP($C14,PREMISSAS!$C$6:$J$13,4,FALSE)))","v":0},null,{"$f":"IF($C14=\"\",0,IF($S14>VLOOKUP($C14,PREMISSAS!$C$6:$J$13,4,FALSE),$S14-VLOOKUP($C14,PREMISSAS!$C$6:$J$13,4,FALSE),0))","v":0},1,"DOMINGO",0,1,null,"","","","","","",""]
[null,null,1,{"$f":"IF(D14=\"\",\"\",IF((D14+1)>'PERIODOS E FERIADOS'!$G$6,\"\",D14+1))","v":"2023-05-07"},"Domingo",null,null,null,null,null,null,null,0,null,0,null,null,null,0,null,null,null,{"$f":"IF($C15=\"\",0,IF($S15<=VLOOKUP($C15,PREMISSAS!$C$6:$J$13,4,FALSE),$S15,VLOOKUP($C15,PREMISSAS!$C$6:$J$13,4,FALSE)))","v":0},null,{"$f":"IF($C15=\"\",0,IF($S15>VLOOKUP($C15,PREMISSAS!$C$6:$J$13,4,FALSE),$S15-VLOOKUP($C15,PREMISSAS!$C$6:$J$13,4,FALSE),0))","v":0},"F","FERIADOS",0,"F",null,"","","","","","",""]
[null,null,2,{"$f":"IF(D15=\"\",\"\",IF((D15+1)>'PERIODOS E FERIADOS'!$G$6,\"\",D15+1))","v":"2023-05-08"},"Segunda",null,null,null,null,null,null,null,0,null,0,null,null,null,0,null,null,null,{"$f":"IF($C16=\"\",0,IF($S16<=VLOOKUP($C16,PREMISSAS!$C$6:$J$13,4,FALSE),$S16,VLOOKUP($C16,PREMISSAS!$C$6:$J$13,4,FALSE)))","v":0},null,{"$f":"IF($C16=\"\",0,IF($S16>VLOOKUP($C16,PREMISSAS!$C$6:$J$13,4,FALSE),$S16-VLOOKUP($C16,PREMISSAS!$C$6:$J$13,4,FALSE),0))","v":0},null,"TOTAL SEMANA",{"$f":"SUM(AB8:AB15)","v":1.8333333333333333},null,null,"","","","","","",""]
[null,null,3,{"$f":"IF(D16=\"\",\"\",IF((D16+1)>'PERIODOS E FERIADOS'!$G$6,\"\",D16+1))","v":"2023-05-09"},"Terça",null,null,null,null,null,null,null,0,null,0,null,null,null,0,null,null,null,{"$f":"IF($C17=\"\",0,IF($S17<=VLOOKUP($C17,PREMISSAS!$C$6:$J$13,4,FALSE),$S17,VLOOKUP($C17,PREMISSAS!$C$6:$J$13,4,FALSE)))","v":0},null,{"$f":"IF($C17=\"\",0,IF($S17>VLOOKUP($C17,PREMISSAS!$C$6:$J$13,4,FALSE),$S17-VLOOKUP($C17,PREMISSAS!$C$6:$J$13,4,FALSE),0))","v":0},null,"JORNADA MENSAL",{"$f":"AB16*5","v":9.1666666666666661},null,null,"","","","","","",""]
[null,null,4,{"$f":"IF(D17=\"\",\"\",IF((D17+1)>'PERIODOS E FERIADOS'!$G$6,\"\",D17+1))","v":"2023-05-10"},"Quarta",null,null,null,null,null,null,null,0,null,0,null,null,null,0,null,null,null,{"$f":"IF($C18=\"\",0,IF($S18<=VLOOKUP($C18,PREMISSAS!$C$6:$J$13,4,FALSE),$S18,VLOOKUP($C18,PREMISSAS!$C$6:$J$13,4,FALSE)))","v":0},null,{"$f":"IF($C18=\"\",0,IF($S18>VLOOKUP($C18,PREMISSAS!$C$6:$J$13,4,FALSE),$S18-VLOOKUP($C18,PREMISSAS!$C$6:$J$13,4,FALSE),0))","v":0},null,null,null,null,null,"","","","","","",""]
[null,null,5,{"$f":"IF(D18=\"\",\"\",IF((D18+1)>'PERIODOS E FERIADOS'!$G$6,\"\",D18+1))","v":"2023-05-11"},"Quinta",null,null,null,null,null,null,null,0,null,0,null,null,null,0,null,null,null,{"$f":"IF($C19=\"\",0,IF($S19<=VLOOKUP($C19,PREMISSAS!$C$6:$J$13,4,FALSE),$S19,VLOOKUP($C19,PREMISSAS!$C$6:$J$13,4,FALSE)))","v":0},null,{"$f":"IF($C19=\"\",0,IF($S19>VLOOKUP($C19,PREMISSAS!$C$6:$J$13,4,FALSE),$S19-VLOOKUP($C19,PREMISSAS!$C$6:$J$13,4,FALSE),0))","v":0},null,{"$f":"IF(AB$16>AB$23,\"Jornada Superior a permitida\",IF(AB$16<=AB$23,\"\"))","v":""},null,null,null,"","","","","","",""]
[null,null,6,{"$f":"IF(D19=\"\",\"\",IF((D19+1)>'PERIODOS E FERIADOS'!$G$6,\"\",D19+1))","v":"2023-05-12"},"Sexta",null,null,null,null,null,null,null,0,null,0,null,null,null,0,null,null,null,{"$f":"IF($C20=\"\",0,IF($S20<=VLOOKUP($C20,PREMISSAS!$C$6:$J$13,4,FALSE),$S20,VLOOKUP($C20,PREMISSAS!$C$6:$J$13,4,FALSE)))","v":0},null,{"$f":"IF($C20=\"\",0,IF($S20>VLOOKUP($C20,PREMISSAS!$C$6:$J$13,4,FALSE),$S20-VLOOKUP($C20,PREMISSAS!$C$6:$J$13,4,FALSE),0))","v":0},null,{"$f":"IF(AB$16>AB$23,\"\",IF(AB$16<=AB$23,\"Jornada Ok\"))","v":"Jornada Ok"},null,null,null,"","","","","","",""]
[null,null,7,{"$f":"IF(D20=\"\",\"\",IF((D20+1)>'PERIODOS E FERIADOS'!$G$6,\"\",D20+1))","v":"2023-05-13"},"Sábado",null,null,null,null,null,null,null,0,null,0,null,null,null,0,null,null,null,{"$f":"IF($C21=\"\",0,IF($S21<=VLOOKUP($C21,PREMISSAS!$C$6:$J$13,4,FALSE),$S21,VLOOKUP($C21,PREMISSAS!$C$6:$J$13,4,FALSE)))","v":0},null,{"$f":"IF($C21=\"\",0,IF($S21>VLOOKUP($C21,PREMISSAS!$C$6:$J$13,4,FALSE),$S21-VLOOKUP($C21,PREMISSAS!$C$6:$J$13,4,FALSE),0))","v":0},null,null,null,null,null,"","","","","","",""]
[null,null,1,{"$f":"IF(D21=\"\",\"\",IF((D21+1)>'PERIODOS E FERIADOS'!$G$6,\"\",D21+1))","v":"2023-05-14"},"Domingo",null,null,null,null,null,null,null,0,null,0,null,null,null,0,null,null,null,{"$f":"IF($C22=\"\",0,IF($S22<=VLOOKUP($C22,PREMISSAS!$C$6:$J$13,4,FALSE),$S22,VLOOKUP($C22,PREMISSAS!$C$6:$J$13,4,FALSE)))","v":0},null,{"$f":"IF($C22=\"\",0,IF($S22>VLOOKUP($C22,PREMISSAS!$C$6:$J$13,4,FALSE),$S22-VLOOKUP($C22,PREMISSAS!$C$6:$J$13,4,FALSE),0))","v":0},null,null,null,null,null,"","","","","","",""]
[null,null,2,{"$f":"IF(D22=\"\",\"\",IF((D22+1)>'PERIODOS E FERIADOS'!$G$6,\"\",D22+1))","v":"2023-05-15"},"Segunda",null,null,null,null,null,null,null,0,null,0,null,null,null,0,null,null,null,{"$f":"IF($C23=\"\",0,IF($S23<=VLOOKUP($C23,PREMISSAS!$C$6:$J$13,4,FALSE),$S23,VLOOKUP($C23,PREMISSAS!$C$6:$J$13,4,FALSE)))","v":0},null,{"$f":"IF($C23=\"\",0,IF($S23>VLOOKUP($C23,PREMISSAS!$C$6:$J$13,4,FALSE),$S23-VLOOKUP($C23,PREMISSAS!$C$6:$J$13,4,FALSE),0))","v":0},null,"Jornada Maxima",1.8333333333333333,null,null,"","","","","","",""]
[null,null,3,{"$f":"IF(D23=\"\",\"\",IF((D23+1)>'PERIODOS E FERIADOS'!$G$6,\"\",D23+1))","v":"2023-05-16"},"Terça",null,null,null,null,null,null,null,0,null,0,null,null,null,0,null,null,null,{"$f":"IF($C24=\"\",0,IF($S24<=VLOOKUP($C24,PREMISSAS!$C$6:$J$13,4,FALSE),$S24,VLOOKUP($C24,PREMISSAS!$C$6:$J$13,4,FALSE)))","v":0},null,{"$f":"IF($C24=\"\",0,IF($S24>VLOOKUP($C24,PREMISSAS!$C$6:$J$13,4,FALSE),$S24-VLOOKUP($C24,PREMISSAS!$C$6:$J$13,4,FALSE),0))","v":0},null,null,null,null,null,"","","","","","",""]
[null,null,4,{"$f":"IF(D24=\"\",\"\",IF((D24+1)>'PERIODOS E FERIADOS'!$G$6,\"\",D24+1))","v":"2023-05-17"},"Quarta",null,null,null,null,null,null,null,0,null,0,null,null,null,0,null,null,null,{"$f":"IF($C25=\"\",0,IF($S25<=VLOOKUP($C25,PREMISSAS!$C$6:$J$13,4,FALSE),$S25,VLOOKUP($C25,PREMISSAS!$C$6:$J$13,4,FALSE)))","v":0},null,{"$f":"IF($C25=\"\",0,IF($S25>VLOOKUP($C25,PREMISSAS!$C$6:$J$13,4,FALSE),$S25-VLOOKUP($C25,PREMISSAS!$C$6:$J$13,4,FALSE),0))","v":0},null,null,null,null,null,"","","","","","",""]
[null,null,5,{"$f":"IF(D25=\"\",\"\",IF((D25+1)>'PERIODOS E FERIADOS'!$G$6,\"\",D25+1))","v":"2023-05-18"},"Quinta",null,null,null,null,null,null,null,0,null,0,null,null,null,0,null,null,null,{"$f":"IF($C26=\"\",0,IF($S26<=VLOOKUP($C26,PREMISSAS!$C$6:$J$13,4,FALSE),$S26,VLOOKUP($C26,PREMISSAS!$C$6:$J$13,4,FALSE)))","v":0},null,{"$f":"IF($C26=\"\",0,IF($S26>VLOOKUP($C26,PREMISSAS!$C$6:$J$13,4,FALSE),$S26-VLOOKUP($C26,PREMISSAS!$C$6:$J$13,4,FALSE),0))","v":0},null,null,null,null,null,"","","","","","",""]
[null,null,6,{"$f":"IF(D26=\"\",\"\",IF((D26+1)>'PERIODOS E FERIADOS'!$G$6,\"\",D26+1))","v":"2023-05-19"},"Sexta",null,null,null,null,null,null,null,0,null,0,null,null,null,0,null,null,null,{"$f":"IF($C27=\"\",0,IF($S27<=VLOOKUP($C27,PREMISSAS!$C$6:$J$13,4,FALSE),$S27,VLOOKUP($C27,PREMISSAS!$C$6:$J$13,4,FALSE)))","v":0},null,{"$f":"IF($C27=\"\",0,IF($S27>VLOOKUP($C27,PREMISSAS!$C$6:$J$13,4,FALSE),$S27-VLOOKUP($C27,PREMISSAS!$C$6:$J$13,4,FALSE),0))","v":0},null,null,null,null,null,"","","","","","",""]
[null,null,7,{"$f":"IF(D27=\"\",\"\",IF((D27+1)>'PERIODOS E FERIADOS'!$G$6,\"\",D27+1))","v":"2023-05-20"},"Sábado",null,null,null,null,null,null,null,0,null,0,null,null,null,0,null,null,null,{"$f":"IF($C28=\"\",0,IF($S28<=VLOOKUP($C28,PREMISSAS!$C$6:$J$13,4,FALSE),$S28,VLOOKUP($C28,PREMISSAS!$C$6:$J$13,4,FALSE)))","v":0},null,{"$f":"IF($C28=\"\",0,IF($S28>VLOOKUP($C28,PREMISSAS!$C$6:$J$13,4,FALSE),$S28-VLOOKUP($C28,PREMISSAS!$C$6:$J$13,4,FALSE),0))","v":0},null,null,null,null,null,"","","","","","",""]
[null,null,1,{"$f":"IF(D28=\"\",\"\",IF((D28+1)>'PERIODOS E FERIADOS'!$G$6,\"\",D28+1))","v":"2023-05-21"},"Domingo",null,null,null,null,null,null,null,0,null,0,null,null,null,0,null,null,null,{"$f":"IF($C29=\"\",0,IF($S29<=VLOOKUP($C29,PREMISSAS!$C$6:$J$13,4,FALSE),$S29,VLOOKUP($C29,PREMISSAS!$C$6:$J$13,4,FALSE)))","v":0},null,{"$f":"IF($C29=\"\",0,IF($S29>VLOOKUP($C29,PREMISSAS!$C$6:$J$13,4,FALSE),$S29-VLOOKUP($C29,PREMISSAS!$C$6:$J$13,4,FALSE),0))","v":0},null,null,null,null,null,"","","","","","",""]
[null,null,2,{"$f":"IF(D29=\"\",\"\",IF((D29+1)>'PERIODOS E FERIADOS'!$G$6,\"\",D29+1))","v":"2023-05-22"},"Segunda",null,null,null,null,null,null,null,0,null,0,null,null,null,0,null,null,null,{"$f":"IF($C30=\"\",0,IF($S30<=VLOOKUP($C30,PREMISSAS!$C$6:$J$13,4,FALSE),$S30,VLOOKUP($C30,PREMISSAS!$C$6:$J$13,4,FALSE)))","v":0},null,{"$f":"IF($C30=\"\",0,IF($S30>VLOOKUP($C30,PREMISSAS!$C$6:$J$13,4,FALSE),$S30-VLOOKUP($C30,PREMISSAS!$C$6:$J$13,4,FALSE),0))","v":0},null,null,null,null,null,"","","","","","",""]
[null,null,3,{"$f":"IF(D30=\"\",\"\",IF((D30+1)>'PERIODOS E FERIADOS'!$G$6,\"\",D30+1))","v":"2023-05-23"},"Terça",null,null,null,null,null,null,null,0,null,0,null,null,null,0,null,null,null,{"$f":"IF($C31=\"\",0,IF($S31<=VLOOKUP($C31,PREMISSAS!$C$6:$J$13,4,FALSE),$S31,VLOOKUP($C31,PREMISSAS!$C$6:$J$13,4,FALSE)))","v":0},null,{"$f":"IF($C31=\"\",0,IF($S31>VLOOKUP($C31,PREMISSAS!$C$6:$J$13,4,FALSE),$S31-VLOOKUP($C31,PREMISSAS!$C$6:$J$13,4,FALSE),0))","v":0},null,null,null,null,null,"","","","","","",""]
[null,null,4,{"$f":"IF(D31=\"\",\"\",IF((D31+1)>'PERIODOS E FERIADOS'!$G$6,\"\",D31+1))","v":"2023-05-24"},"Quarta",null,null,null,null,null,null,null,0,null,0,null,null,null,0,null,null,null,{"$f":"IF($C32=\"\",0,IF($S32<=VLOOKUP($C32,PREMISSAS!$C$6:$J$13,4,FALSE),$S32,VLOOKUP($C32,PREMISSAS!$C$6:$J$13,4,FALSE)))","v":0},null,{"$f":"IF($C32=\"\",0,IF($S32>VLOOKUP($C32,PREMISSAS!$C$6:$J$13,4,FALSE),$S32-VLOOKUP($C32,PREMISSAS!$C$6:$J$13,4,FALSE),0))","v":0},null,null,null,null,null,{"$f":"IF(OR(F32=\"\",F32=0,F32=\"FALTA\",F32=\"SUSPENSO\",F32=\"SUSPENSÃO\"),\"\",TEXT(F32,\"##\"\":\"\"##\"))","v":""},{"$f":"IF(OR(G32=\"\",G32=0,G32=\"FALTA\",G32=\"SUSPENSO\",G32=\"SUSPENSÃO\"),\"\",TEXT(G32,\"##\"\":\"\"##\"))","v":""},"","",{"$f":"IF(OR(J32=\"\",J32=0,J32=\"FALTA\",J32=\"SUSPENSO\",J32=\"SUSPENSÃO\"),\"\",TEXT(J32,\"##\"\":\"\"##\"))","v":""},{"$f":"IF(OR(K32=\"\",K32=0,K32=\"FALTA\",K32=\"SUSPENSO\",K32=\"SUSPENSÃO\"),\"\",TEXT(K32,\"##\"\":\"\"##\"))","v":""},""]
[null,null,5,{"$f":"IF(D32=\"\",\"\",IF((D32+1)>'PERIODOS E FERIADOS'!$G$6,\"\",D32+1))","v":"2023-05-25"},"Quinta",null,null,null,null,null,null,null,0,null,0,null,null,null,0,null,null,null,{"$f":"IF($C33=\"\",0,IF($S33<=VLOOKUP($C33,PREMISSAS!$C$6:$J$13,4,FALSE),$S33,VLOOKUP($C33,PREMISSAS!$C$6:$J$13,4,FALSE)))","v":0},null,{"$f":"IF($C33=\"\",0,IF($S33>VLOOKUP($C33,PREMISSAS!$C$6:$J$13,4,FALSE),$S33-VLOOKUP($C33,PREMISSAS!$C$6:$J$13,4,FALSE),0))","v":0},null,null,null,null,null,{"$f":"IF(OR(F33=\"\",F33=0,F33=\"FALTA\",F33=\"SUSPENSO\",F33=\"SUSPENSÃO\"),\"\",TEXT(F33,\"##\"\":\"\"##\"))","v":""},"","","","","",""]
[null,null,6,{"$f":"IF(D33=\"\",\"\",IF((D33+1)>'PERIODOS E FERIADOS'!$G$6,\"\",D33+1))","v":"2023-05-26"},"Sexta",null,null,null,null,null,null,null,0,null,0,null,null,null,0,null,null,null,{"$f":"IF($C34=\"\",0,IF($S34<=VLOOKUP($C34,PREMISSAS!$C$6:$J$13,4,FALSE),$S34,VLOOKUP($C34,PREMISSAS!$C$6:$J$13,4,FALSE)))","v":0},null,{"$f":"IF($C34=\"\",0,IF($S34>VLOOKUP($C34,PREMISSAS!$C$6:$J$13,4,FALSE),$S34-VLOOKUP($C34,PREMISSAS!$C$6:$J$13,4,FALSE),0))","v":0},null,null,null,null,null,"","","","","","",""]
[null,null,7,{"$f":"IF(D34=\"\",\"\",IF((D34+1)>'PERIODOS E FERIADOS'!$G$6,\"\",D34+1))","v":"2023-05-27"},"Sábado",null,null,null,null,null,null,null,0,null,0,null,null,null,0,null,null,null,{"$f":"IF($C35=\"\",0,IF($S35<=VLOOKUP($C35,PREMISSAS!$C$6:$J$13,4,FALSE),$S35,VLOOKUP($C35,PREMISSAS!$C$6:$J$13,4,FALSE)))","v":0},null,{"$f":"IF($C35=\"\",0,IF($S35>VLOOKUP($C35,PREMISSAS!$C$6:$J$13,4,FALSE),$S35-VLOOKUP($C35,PREMISSAS!$C$6:$J$13,4,FALSE),0))","v":0},null,null,null,null,null,"","","","","","",""]
[null,null,1,{"$f":"IF(D35=\"\",\"\",IF((D35+1)>'PERIODOS E FERIADOS'!$G$6,\"\",D35+1))","v":"2023-05-28"},"Domingo",null,null,null,null,null,null,null,0,null,0,null,null,null,0,null,null,null,{"$f":"IF($C36=\"\",0,IF($S36<=VLOOKUP($C36,PREMISSAS!$C$6:$J$13,4,FALSE),$S36,VLOOKUP($C36,PREMISSAS!$C$6:$J$13,4,FALSE)))","v":0},null,{"$f":"IF($C36=\"\",0,IF($S36>VLOOKUP($C36,PREMISSAS!$C$6:$J$13,4,FALSE),$S36-VLOOKUP($C36,PREMISSAS!$C$6:$J$13,4,FALSE),0))","v":0},null,null,null,null,null,"","","","","","",""]
[null,null,2,{"$f":"IF(D36=\"\",\"\",IF((D36+1)>'PERIODOS E FERIADOS'!$G$6,\"\",D36+1))","v":"2023-05-29"},"Segunda",null,null,null,null,null,null,null,0,null,0,null,null,null,0,null,null,null,{"$f":"IF($C37=\"\",0,IF($S37<=VLOOKUP($C37,PREMISSAS!$C$6:$J$13,4,FALSE),$S37,VLOOKUP($C37,PREMISSAS!$C$6:$J$13,4,FALSE)))","v":0},null,{"$f":"IF($C37=\"\",0,IF($S37>VLOOKUP($C37,PREMISSAS!$C$6:$J$13,4,FALSE),$S37-VLOOKUP($C37,PREMISSAS!$C$6:$J$13,4,FALSE),0))","v":0},null,null,null,null,null,"","","","","","",""]
[null,null,3,{"$f":"IF(D37=\"\",\"\",IF((D37+1)>'PERIODOS E FERIADOS'!$G$6,\"\",D37+1))","v":"2023-05-30"},"Terça",null,null,null,null,null,null,null,0,null,0,null,null,null,0,null,null,null,{"$f":"IF($C38=\"\",0,IF($S38<=VLOOKUP($C38,PREMISSAS!$C$6:$J$13,4,FALSE),$S38,VLOOKUP($C38,PREMISSAS!$C$6:$J$13,4,FALSE)))","v":0},null,{"$f":"IF($C38=\"\",0,IF($S38>VLOOKUP($C38,PREMISSAS!$C$6:$J$13,4,FALSE),$S38-VLOOKUP($C38,PREMISSAS!$C$6:$J$13,4,FALSE),0))","v":0},null,null,null,null,null,"","","","","","",""]
[null,null,4,{"$f":"IF(D38=\"\",\"\",IF((D38+1)>'PERIODOS E FERIADOS'!$G$6,\"\",D38+1))","v":"2023-05-31"},"Quarta",null,null,null,null,null,null,null,0,null,0,null,null,null,0,null,null,null,{"$f":"IF($C39=\"\",0,IF($S39<=VLOOKUP($C39,PREMISSAS!$C$6:$J$13,4,FALSE),$S39,VLOOKUP($C39,PREMISSAS!$C$6:$J$13,4,FALSE)))","v":0},null,{"$f":"IF($C39=\"\",0,IF($S39>VLOOKUP($C39,PREMISSAS!$C$6:$J$13,4,FALSE),$S39-VLOOKUP($C39,PREMISSAS!$C$6:$J$13,4,FALSE),0))","v":0},null,null,null,null,null,"","","","","","",""]
[]
[null,null,null,"TOTAIS",null,null,"Faltas / Suspensão",null,{"$f":"COUNTIF($F$9:$F$39,\"FALTA\")+COUNTIF($F$9:$F$39,\"SUSPENSÃO\")+COUNTIF($F$9:$F$39,\"SUSPENSO\")+COUNTIF($F$9:$F$39,\"SUSPENSAO\")","v":0},null,null,null,{"$f":"SUM($M$9:$M$39)","v":0},null,{"$f":"SUM($O$9:$O$39)","v":0},null,null,null,{"$f":"SUM(S$9:S$39)","v":0},null,{"$f":"$AK$41","v":0},null,{"$f":"SUM(W$9:W$39)","v":0},null,{"$f":"SUM(Y$9:Y$39)","v":0},null,null,null,null,null,null,null,null,null,null,null,{"$f":"SUM(AK9:AK39)","v":0}]
[]
[null,null,null,"OBSERVAÇÕES:"]

{"sheet":"FUNC 18","index":22,"n_rows":43,"n_cols":37,"rows_kept":43,"cut":false,"hidden":false,"merged":[[5,30,5,33],[40,3,40,5],[40,6,40,7],[40,8,40,10],[42,3,43,24],[18,26,18,27],[19,26,19,27],[3,3,4,27],[5,3,5,4],[5,5,5,10],[5,12,5,20],[5,22,5,24],[5,26,5,27]]}
[]
[]
[]
[null,null,null,{"$f":"'PERIODOS E FERIADOS'!$E$5","v":0}]
[]
[null,null,null,"Funcionário",null,{"$f":"FUNCIONÁRIOS!E22","v":18},null,null,null,null,null,null,"H.E. / Atrasos / A.N",null,null,null,null,null,null,null,null,null,"Distrib. H.E. p/ Faixa",null,null,null,"CARGA HORÁRIA",null,null,null,"ESPELHO"]
[]
[null,null,null,"Data","Dia Semana","Entrada","Saída","Entrada","Saída","Entrada","Saída",null,"H. Diária",null,"Atrasos",null,"Abona",null,"Horas Extras",null,"Adc. Noturno",null,{"$f":"PREMISSAS!H6","v":0.5},null,{"$f":"PREMISSAS!H12","v":1},2,"SEGUNDA",0.33333333333333331,2,null,"Entrada","Saída","Entrada","Saída","Entrada","Saída","AN "]
[null,null,{"$f":"IF(NOT(ISERROR(VLOOKUP(D9,rngFeriados,1,FALSE))),\"F\",IF(D9=\"\",\"\",WEEKDAY($D9,1)))","v":"F"},{"$f":"'PERIODOS E FERIADOS'!$E$6","v":"2023-05-01"},{"$f":"IF(D9=\"\",\"\",IF(WEEKDAY(D9,1)=1,\"Domingo\",IF(WEEKDAY(D9,1)=2,\"Segunda\",IF(WEEKDAY(D9,1)=3,\"Terça\",IF(WEEKDAY(D9,1)=4,\"Quarta\",IF(WEEKDAY(D9,1)=5,\"Quinta\",IF(WEEKDAY(D9,1)=6,\"Sexta\",IF(WEEKDAY(D9,1)=7,\"Sábado\"))))))))","v":"Segunda"},null,null,null,null,null,null,null,{"$f":"IF(ISERROR(IF(OR($AF9=\"\",$AF9=0),0,(IF(TEXT($AF9,\"[hh]:mm:ss\")<TEXT($AE9,\"[hh]:mm:ss\"),(1-$AE9+$AF9),$AF9-$AE9))+IF(OR($AH9=\"\",$AH9=0),0,(IF(TEXT($AH9,\"[hh]:mm:ss\")<TEXT($AG9,\"[hh]:mm:ss\"),(1-$AG9+$AH9),$AH9-$AG9))+IF(OR($AJ9=\"\",$AJ9=0),0,(IF(TEXT($AJ9,\"[hh]:mm:ss\")<TEXT($AI9,\"[hh]:mm:ss\"),(1-$AI9+$AJ9),$AJ9-$AI9)))))),0,IF(OR($AF9=\"\",$AF9=0),0,(IF(TEXT($AF9,\"[hh]:mm:ss\")<TEXT($AE9,\"[hh]:mm:ss\"),(1-$AE9+$AF9),$AF9-$AE9))+IF(OR($AH9=\"\",$AH9=0),0,(IF(TEXT($AH9,\"[hh]:mm:ss\")<TEXT($AG9,\"[hh]:mm:ss\"),(1-$AG9+$AH9),$AH9-$AG9))+IF(OR($AJ9=\"\",$AJ9=0),0,(IF(TEXT($AJ9,\"[hh]:mm:ss\")<TEXT($AI9,\"[hh]:mm:ss\"),(1-$AI9+$AJ9),$AJ9-$AI9))))))","v":0},null,{"$f":"IF($C9=\"\",0,IF(Q9=\"Sim\",0,IF(TEXT(IF(OR((VLOOKUP($C9,$Z$8:$AB$15,3,FALSE)-$M9)<0,$AE9=\"\"),0,(VLOOKUP($C9,$Z$8:$AB$15,3,FALSE)-$M9)),\"[hh]:mm\")<=TEXT(rngTolerancia,\"[hh]:mm\"),0,IF(OR((VLOOKUP($C9,$Z$8:$AB$15,3,FALSE)-$M9)<0,$AE9=\"\"),0,(VLOOKUP($C9,$Z$8:$AB$15,3,FALSE)-$M9)))))","v":0},null,null,null,{"$f":"IF($C9=\"\",0,IF(TEXT(IF(($M9-VLOOKUP($C9,$Z$8:$AB$15,3,FALSE))<0,0,($M9-VLOOKUP($C9,$Z$8:$AB$15,3,FALSE))),\"[hh]:mm\")<=TEXT(rngTolerancia,\"[hh]:mm\"),0,IF(($M9-VLOOKUP($C9,$Z$8:$AB$15,3,FALSE))<0,0,($M9-VLOOKUP($C9,$Z$8:$AB$15,3,FALSE)))))","v":0},null,null,null,{"$f":"IF($C9=\"\",0,IF($S9<=VLOOKUP($C9,PREMISSAS!$C$6:$J$13,4,FALSE),$S9,VLOOKUP($C9,PREMISSAS!$C$6:$J$13,4,FALSE)))","v":0},null,{"$f":"IF($C9=\"\",0,IF($S9>VLOOKUP($C9,PREMISSAS!$C$6:$J$13,4,FALSE),$S9-VLOOKUP($C9,PREMISSAS!$C$6:$J$13,4,FALSE),0))","v":0},3,"TERÇA",0.33333333333333331,3,null,{"$f":"IF(OR(F9=\"\",F9=0,F9=\"FALTA\",F9=\"SUSPENSO\",F9=\"SUSPENSÃO\"),\"\",TEXT(F9,\"##\"\":\"\"##\"))","v":""},{"$f":"IF(OR(G9=\"\",G9=0,G9=\"FALTA\",G9=\"SUSPENSO\",G9=\"SUSPENSÃO\"),\"\",TEXT(G9,\"##\"\":\"\"##\"))","v":""},"","",{"$f":"IF(OR(J9=\"\",J9=0,J9=\"FALTA\",J9=\"SUSPENSO\",J9=\"SUSPENSÃO\"),\"\",TEXT(J9,\"##\"\":\"\"##\"))","v":""},{"$f":"IF(OR(K9=\"\",K9=0,K9=\"FALTA\",K9=\"SUSPENSO\",K9=\"SUSPENSÃO\"),\"\",TEXT(K9,\"##\"\":\"\"##\"))","v":""},{"$f":"IF(OR(U9=\"\",U9=0,U9=\"FALTA\",U9=\"SUSPENSO\",U9=\"SUSPENSÃO\"),\"\",TEXT(TEXT(U9,\"00\"\":\"\"00\"),\"[hh]:mm\")*1)","v":""}]
[null,null,3,{"$f":"IF(D9=\"\",\"\",IF((D9+1)>'PERIODOS E FERIADOS'!$G$6,\"\",D9+1))","v":"2023-05-02"},{"$f":"IF(D10=\"\",\"\",IF(WEEKDAY(D10,1)=1,\"Domingo\",IF(WEEKDAY(D10,1)=2,\"Segunda\",IF(WEEKDAY(D10,1)=3,\"Terça\",IF(WEEKDAY(D10,1)=4,\"Quarta\",IF(WEEKDAY(D10,1)=5,\"Quinta\",IF(WEEKDAY(D10,1)=6,\"Sexta\",IF(WEEKDAY(D10,1)=7,\"Sábado\"))))))))","v":"Terça"},null,null,null,null,null,null,null,{"$f":"IF(ISERROR(IF(OR($AF10=\"\",$AF10=0),0,(IF(TEXT($AF10,\"[hh]:mm:ss\")<TEXT($AE10,\"[hh]:mm:ss\"),(1-$AE10+$AF10),$AF10-$AE10))+IF(OR($AH10=\"\",$AH10=0),0,(IF(TEXT($AH10,\"[hh]:mm:ss\")<TEXT($AG10,\"[hh]:mm:ss\"),(1-$AG10+$AH10),$AH10-$AG10))+IF(OR($AJ10=\"\",$AJ10=0),0,(IF(TEXT($AJ10,\"[hh]:mm:ss\")<TEXT($AI10,\"[hh]:mm:ss\"),(1-$AI10+$AJ10),$AJ10-$AI10)))))),0,IF(OR($AF10=\"\",$AF10=0),0,(IF(TEXT($AF10,\"[hh]:mm:ss\")<TEXT($AE10,\"[hh]:mm:ss\"),(1-$AE10+$AF10),$AF10-$AE10))+IF(OR($AH10=\"\",$AH10=0),0,(IF(TEXT($AH10,\"[hh]:mm:ss\")<TEXT($AG10,\"[hh]:mm:ss\"),(1-$AG10+$AH10),$AH10-$AG10))+IF(OR($AJ10=\"\",$AJ10=0),0,(IF(TEXT($AJ10,\"[hh]:mm:ss\")<TEXT($AI10,\"[hh]:mm:ss\"),(1-$AI10+$AJ10),$AJ10-$AI10))))))","v":0},null,{"$f":"IF($C10=\"\",0,IF(Q10=\"Sim\",0,IF(TEXT(IF(OR((VLOOKUP($C10,$Z$8:$AB$15,3,FALSE)-$M10)<0,$AE10=\"\"),0,(VLOOKUP($C10,$Z$8:$AB$15,3,FALSE)-$M10)),\"[hh]:mm\")<=TEXT(rngTolerancia,\"[hh]:mm\"),0,IF(OR((VLOOKUP($C10,$Z$8:$AB$15,3,FALSE)-$M10)<0,$AE10=\"\"),0,(VLOOKUP($C10,$Z$8:$AB$15,3,FALSE)-$M10)))))","v":0},null,null,null,0,null,null,null,{"$f":"IF($C10=\"\",0,IF($S10<=VLOOKUP($C10,PREMISSAS!$C$6:$J$13,4,FALSE),$S10,VLOOKUP($C10,PREMISSAS!$C$6:$J$13,4,FALSE)))","v":0},null,{"$f":"IF($C10=\"\",0,IF($S10>VLOOKUP($C10,PREMISSAS!$C$6:$J$13,4,FALSE),$S10-VLOOKUP($C10,PREMISSAS!$C$6:$J$13,4,FALSE),0))","v":0},4,"QUARTA",0.33333333333333331,4,null,{"$f":"IF(OR(F10=\"\",F10=0,F10=\"FALTA\",F10=\"SUSPENSO\",F10=\"SUSPENSÃO\"),\"\",TEXT(F10,\"##\"\":\"\"##\"))","v":""},"","","","","",{"$f":"IF(OR(U10=\"\",U10=0,U10=\"FALTA\",U10=\"SUSPENSO\",U10=\"SUSPENSÃO\"),\"\",TEXT(TEXT(U10,\"00\"\":\"\"00\"),\"[hh]:mm\")*1)","v":""}]
[null,null,4,{"$f":"IF(D10=\"\",\"\",IF((D10+1)>'PERIODOS E FERIADOS'!$G$6,\"\",D10+1))","v":"2023-05-03"},"Quarta",null,null,null,null,null,null,null,0,null,0,null,null,null,0,null,null,null,{"$f":"IF($C11=\"\",0,IF($S11<=VLOOKUP($C11,PREMISSAS!$C$6:$J$13,4,FALSE),$S11,VLOOKUP($C11,PREMISSAS!$C$6:$J$13,4,FALSE)))","v":0},null,{"$f":"IF($C11=\"\",0,IF($S11>VLOOKUP($C11,PREMISSAS!$C$6:$J$13,4,FALSE),$S11-VLOOKUP($C11,PREMISSAS!$C$6:$J$13,4,FALSE),0))","v":0},5,"QUINTA",0.33333333333333331,5,null,"","","","","","",""]
[null,null,5,{"$f":"IF(D11=\"\",\"\",IF((D11+1)>'PERIODOS E FERIADOS'!$G$6,\"\",D11+1))","v":"2023-05-04"},"Quinta",null,null,null,null,null,null,null,0,null,0,null,null,null,0,null,null,null,{"$f":"IF($C12=\"\",0,IF($S12<=VLOOKUP($C12,PREMISSAS!$C$6:$J$13,4,FALSE),$S12,VLOOKUP($C12,PREMISSAS!$C$6:$J$13,4,FALSE)))","v":0},null,{"$f":"IF($C12=\"\",0,IF($S12>VLOOKUP($C12,PREMISSAS!$C$6:$J$13,4,FALSE),$S12-VLOOKUP($C12,PREMISSAS!$C$6:$J$13,4,FALSE),0))","v":0},6,"SEXTA",0.33333333333333331,6,null,"","","","","","",{"$f":"IF(OR(U12=\"\",U12=0,U12=\"FALTA\",U12=\"SUSPENSO\",U12=\"SUSPENSÃO\"),\"\",TEXT(TEXT(U12,\"##\"\":\"\"##\"),\"[hh]:mm\")*1)","v":""}]
[null,null,6,{"$f":"IF(D12=\"\",\"\",IF((D12+1)>'PERIODOS E FERIADOS'!$G$6,\"\",D12+1))","v":"2023-05-05"},"Sexta",null,null,null,null,null,null,null,0,null,0,null,null,null,0,null,null,null,{"$f":"IF($C13=\"\",0,IF($S13<=VLOOKUP($C13,PREMISSAS!$C$6:$J$13,4,FALSE),$S13,VLOOKUP($C13,PREMISSAS!$C$6:$J$13,4,FALSE)))","v":0},null,{"$f":"IF($C13=\"\",0,IF($S13>VLOOKUP($C13,PREMISSAS!$C$6:$J$13,4,FALSE),$S13-VLOOKUP($C13,PREMISSAS!$C$6:$J$13,4,FALSE),0))","v":0},7,"SÁBADO",0.16666666666666666,7,null,"","","","","","",""]
[null,null,7,{"$f":"IF(D13=\"\",\"\",IF((D13+1)>'PERIODOS E FERIADOS'!$G$6,\"\",D13+1))","v":"2023-05-06"},"Sábado",null,null,null,null,null,null,null,0,null,0,null,null,null,0,null,null,null,{"$f":"IF($C14=\"\",0,IF($S14<=VLOOKUP($C14,PREMISSAS!$C$6:$J$13,4,FALSE),$S14,VLOOKUP($C14,PREMISSAS!$C$6:$J$13,4,FALSE)))","v":0},null,{"$f":"IF($C14=\"\",0,IF($S14>VLOOKUP($C14,PREMISSAS!$C$6:$J$13,4,FALSE),$S14-VLOOKUP($C14,PREMISSAS!$C$6:$J$13,4,FALSE),0))","v":0},1,"DOMINGO",0,1,null,"","","","","","",""]
[null,null,1,{"$f":"IF(D14=\"\",\"\",IF((D14+1)>'PERIODOS E FERIADOS'!$G$6,\"\",D14+1))","v":"2023-05-07"},"Domingo",null,null,null,null,null,null,null,0,null,0,null,null,null,0,null,null,null,{"$f":"IF($C15=\"\",0,IF($S15<=VLOOKUP($C15,PREMISSAS!$C$6:$J$13,4,FALSE),$S15,VLOOKUP($C15,PREMISSAS!$C$6:$J$13,4,FALSE)))","v":0},null,{"$f":"IF($C15=\"\",0,IF($S15>VLOOKUP($C15,PREMISSAS!$C$6:$J$13,4,FALSE),$S15-VLOOKUP($C15,PREMISSAS!$C$6:$J$13,4,FALSE),0))","v":0},"F","FERIADOS",0,"F",null,"","","","","","",""]
[null,null,2,{"$f":"IF(D15=\"\",\"\",IF((D15+1)>'PERIODOS E FERIADOS'!$G$6,\"\",D15+1))","v":"2023-05-08"},"Segunda",null,null,null,null,null,null,null,0,null,0,null,null,null,0,null,null,null,{"$f":"IF($C16=\"\",0,IF($S16<=VLOOKUP($C16,PREMISSAS!$C$6:$J$13,4,FALSE),$S16,VLOOKUP($C16,PREMISSAS!$C$6:$J$13,4,FALSE)))","v":0},null,{"$f":"IF($C16=\"\",0,IF($S16>VLOOKUP($C16,PREMISSAS!$C$6:$J$13,4,FALSE),$S16-VLOOKUP($C16,PREMISSAS!$C$6:$J$13,4,FALSE),0))","v":0},null,"TOTAL SEMANA",{"$f":"SUM(AB8:AB15)","v":1.8333333333333333},null,null,"","","","","","",""]
[null,null,3,{"$f":"IF(D16=\"\",\"\",IF((D16+1)>'PERIODOS E FERIADOS'!$G$6,\"\",D16+1))","v":"2023-05-09"},"Terça",null,null,null,null,null,null,null,0,null,0,null,null,null,0,null,null,null,{"$f":"IF($C17=\"\",0,IF($S17<=VLOOKUP($C17,PREMISSAS!$C$6:$J$13,4,FALSE),$S17,VLOOKUP($C17,PREMISSAS!$C$6:$J$13,4,FALSE)))","v":0},null,{"$f":"IF($C17=\"\",0,IF($S17>VLOOKUP($C17,PREMISSAS!$C$6:$J$13,4,FALSE),$S17-VLOOKUP($C17,PREMISSAS!$C$6:$J$13,4,FALSE),0))","v":0},null,"JORNADA MENSAL",{"$f":"AB16*5","v":9.1666666666666661},null,null,"","","","","","",""]
[null,null,4,{"$f":"IF(D17=\"\",\"\",IF((D17+1)>'PERIODOS E FERIADOS'!$G$6,\"\",D17+1))","v":"2023-05-10"},"Quarta",null,null,null,null,null,null,null,0,null,0,null,null,null,0,null,null,null,{"$f":"IF($C18=\"\",0,IF($S18<=VLOOKUP($C18,PREMISSAS!$C$6:$J$13,4,FALSE),$S18,VLOOKUP($C18,PREMISSAS!$C$6:$J$13,4,FALSE)))","v":0},null,{"$f":"IF($C18=\"\",0,IF($S18>VLOOKUP($C18,PREMISSAS!$C$6:$J$13,4,FALSE),$S18-VLOOKUP($C18,PREMISSAS!$C$6:$J$13,4,FALSE),0))","v":0},null,null,null,null,null,"","","","","","",""]
[null,null,5,{"$f":"IF(D18=\"\",\"\",IF((D18+1)>'PERIODOS E FERIADOS'!$G$6,\"\",D18+1))","v":"2023-05-11"},"Quinta",null,null,null,null,null,null,null,0,null,0,null,null,null,0,null,null,null,{"$f":"IF($C19=\"\",0,IF($S19<=VLOOKUP($C19,PREMISSAS!$C$6:$J$13,4,FALSE),$S19,VLOOKUP($C19,PREMISSAS!$C$6:$J$13,4,FALSE)))","v":0},null,{"$f":"IF($C19=\"\",0,IF($S19>VLOOKUP($C19,PREMISSAS!$C$6:$J$13,4,FALSE),$S19-VLOOKUP($C19,PREMISSAS!$C$6:$J$13,4,FALSE),0))","v":0},null,{"$f":"IF(AB$16>AB$23,\"Jornada Superior a permitida\",IF(AB$16<=AB$23,\"\"))","v":""},null,null,null,"","","","","","",""]
[null,null,6,{"$f":"IF(D19=\"\",\"\",IF((D19+1)>'PERIODOS E FERIADOS'!$G$6,\"\",D19+1))","v":"2023-05-12"},"Sexta",null,null,null,null,null,null,null,0,null,0,null,null,null,0,null,null,null,{"$f":"IF($C20=\"\",0,IF($S20<=VLOOKUP($C20,PREMISSAS!$C$6:$J$13,4,FALSE),$S20,VLOOKUP($C20,PREMISSAS!$C$6:$J$13,4,FALSE)))","v":0},null,{"$f":"IF($C20=\"\",0,IF($S20>VLOOKUP($C20,PREMISSAS!$C$6:$J$13,4,FALSE),$S20-VLOOKUP($C20,PREMISSAS!$C$6:$J$13,4,FALSE),0))","v":0},null,{"$f":"IF(AB$16>AB$23,\"\",IF(AB$16<=AB$23,\"Jornada Ok\"))","v":"Jornada Ok"},null,null,null,"","","","","","",""]
[null,null,7,{"$f":"IF(D20=\"\",\"\",IF((D20+1)>'PERIODOS E FERIADOS'!$G$6,\"\",D20+1))","v":"2023-05-13"},"Sábado",null,null,null,null,null,null,null,0,null,0,null,null,null,0,null,null,null,{"$f":"IF($C21=\"\",0,IF($S21<=VLOOKUP($C21,PREMISSAS!$C$6:$J$13,4,FALSE),$S21,VLOOKUP($C21,PREMISSAS!$C$6:$J$13,4,FALSE)))","v":0},null,{"$f":"IF($C21=\"\",0,IF($S21>VLOOKUP($C21,PREMISSAS!$C$6:$J$13,4,FALSE),$S21-VLOOKUP($C21,PREMISSAS!$C$6:$J$13,4,FALSE),0))","v":0},null,null,null,null,null,"","","","","","",""]
[null,null,1,{"$f":"IF(D21=\"\",\"\",IF((D21+1)>'PERIODOS E FERIADOS'!$G$6,\"\",D21+1))","v":"2023-05-14"},"Domingo",null,null,null,null,null,null,null,0,null,0,null,null,null,0,null,null,null,{"$f":"IF($C22=\"\",0,IF($S22<=VLOOKUP($C22,PREMISSAS!$C$6:$J$13,4,FALSE),$S22,VLOOKUP($C22,PREMISSAS!$C$6:$J$13,4,FALSE)))","v":0},null,{"$f":"IF($C22=\"\",0,IF($S22>VLOOKUP($C22,PREMISSAS!$C$6:$J$13,4,FALSE),$S22-VLOOKUP($C22,PREMISSAS!$C$6:$J$13,4,FALSE),0))","v":0},null,null,null,null,null,"","","","","","",""]
[null,null,2,{"$f":"IF(D22=\"\",\"\",IF((D22+1)>'PERIODOS E FERIADOS'!$G$6,\"\",D22+1))","v":"2023-05-15"},"Segunda",null,null,null,null,null,null,null,0,null,0,null,null,null,0,null,null,null,{"$f":"IF($C23=\"\",0,IF($S23<=VLOOKUP($C23,PREMISSAS!$C$6:$J$13,4,FALSE),$S23,VLOOKUP($C23,PREMISSAS!$C$6:$J$13,4,FALSE)))","v":0},null,{"$f":"IF($C23=\"\",0,IF($S23>VLOOKUP($C23,PREMISSAS!$C$6:$J$13,4,FALSE),$S23-VLOOKUP($C23,PREMISSAS!$C$6:$J$13,4,FALSE),0))","v":0},null,"Jornada Maxima",1.8333333333333333,null,null,"","","","","","",""]
[null,null,3,{"$f":"IF(D23=\"\",\"\",IF((D23+1)>'PERIODOS E FERIADOS'!$G$6,\"\",D23+1))","v":"2023-05-16"},"Terça",null,null,null,null,null,null,null,0,null,0,null,null,null,0,null,null,null,{"$f":"IF($C24=\"\",0,IF($S24<=VLOOKUP($C24,PREMISSAS!$C$6:$J$13,4,FALSE),$S24,VLOOKUP($C24,PREMISSAS!$C$6:$J$13,4,FALSE)))","v":0},null,{"$f":"IF($C24=\"\",0,IF($S24>VLOOKUP($C24,PREMISSAS!$C$6:$J$13,4,FALSE),$S24-VLOOKUP($C24,PREMISSAS!$C$6:$J$13,4,FALSE),0))","v":0},null,null,null,null,null,"","","","","","",""]
[null,null,4,{"$f":"IF(D24=\"\",\"\",IF((D24+1)>'PERIODOS E FERIADOS'!$G$6,\"\",D24+1))","v":"2023-05-17"},"Quarta",null,null,null,null,null,null,null,0,null,0,null,null,null,0,null,null,null,{"$f":"IF($C25=\"\",0,IF($S25<=VLOOKUP($C25,PREMISSAS!$C$6:$J$13,4,FALSE),$S25,VLOOKUP($C25,PREMISSAS!$C$6:$J$13,4,FALSE)))","v":0},null,{"$f":"IF($C25=\"\",0,IF($S25>VLOOKUP($C25,PREMISSAS!$C$6:$J$13,4,FALSE),$S25-VLOOKUP($C25,PREMISSAS!$C$6:$J$13,4,FALSE),0))","v":0},null,null,null,null,null,"","","","","","",""]
[null,null,5,{"$f":"IF(D25=\"\",\"\",IF((D25+1)>'PERIODOS E FERIADOS'!$G$6,\"\",D25+1))","v":"2023-05-18"},"Quinta",null,null,null,null,null,null,null,0,null,0,null,null,null,0,null,null,null,{"$f":"IF($C26=\"\",0,IF($S26<=VLOOKUP($C26,PREMISSAS!$C$6:$J$13,4,FALSE),$S26,VLOOKUP($C26,PREMISSAS!$C$6:$J$13,4,FALSE)))","v":0},null,{"$f":"IF($C26=\"\",0,IF($S26>VLOOKUP($C26,PREMISSAS!$C$6:$J$13,4,FALSE),$S26-VLOOKUP($C26,PREMISSAS!$C$6:$J$13,4,FALSE),0))","v":0},null,null,null,null,null,"","","","","","",""]
[null,null,6,{"$f":"IF(D26=\"\",\"\",IF((D26+1)>'PERIODOS E FERIADOS'!$G$6,\"\",D26+1))","v":"2023-05-19"},"Sexta",null,null,null,null,null,null,null,0,null,0,null,null,null,0,null,null,null,{"$f":"IF($C27=\"\",0,IF($S27<=VLOOKUP($C27,PREMISSAS!$C$6:$J$13,4,FALSE),$S27,VLOOKUP($C27,PREMISSAS!$C$6:$J$13,4,FALSE)))","v":0},null,{"$f":"IF($C27=\"\",0,IF($S27>VLOOKUP($C27,PREMISSAS!$C$6:$J$13,4,FALSE),$S27-VLOOKUP($C27,PREMISSAS!$C$6:$J$13,4,FALSE),0))","v":0},null,null,null,null,null,"","","","","","",""]
[null,null,7,{"$f":"IF(D27=\"\",\"\",IF((D27+1)>'PERIODOS E FERIADOS'!$G$6,\"\",D27+1))","v":"2023-05-20"},"Sábado",null,null,null,null,null,null,null,0,null,0,null,null,null,0,null,null,null,{"$f":"IF($C28=\"\",0,IF($S28<=VLOOKUP($C28,PREMISSAS!$C$6:$J$13,4,FALSE),$S28,VLOOKUP($C28,PREMISSAS!$C$6:$J$13,4,FALSE)))","v":0},null,{"$f":"IF($C28=\"\",0,IF($S28>VLOOKUP($C28,PREMISSAS!$C$6:$J$13,4,FALSE),$S28-VLOOKUP($C28,PREMISSAS!$C$6:$J$13,4,FALSE),0))","v":0},null,null,null,null,null,"","","","","","",""]
[null,null,1,{"$f":"IF(D28=\"\",\"\",IF((D28+1)>'PERIODOS E FERIADOS'!$G$6,\"\",D28+1))","v":"2023-05-21"},"Domingo",null,null,null,null,null,null,null,0,null,0,null,null,null,0,null,null,null,{"$f":"IF($C29=\"\",0,IF($S29<=VLOOKUP($C29,PREMISSAS!$C$6:$J$13,4,FALSE),$S29,VLOOKUP($C29,PREMISSAS!$C$6:$J$13,4,FALSE)))","v":0},null,{"$f":"IF($C29=\"\",0,IF($S29>VLOOKUP($C29,PREMISSAS!$C$6:$J$13,4,FALSE),$S29-VLOOKUP($C29,PREMISSAS!$C$6:$J$13,4,FALSE),0))","v":0},null,null,null,null,null,"","","","","","",""]
[null,null,2,{"$f":"IF(D29=\"\",\"\",IF((D29+1)>'PERIODOS E FERIADOS'!$G$6,\"\",D29+1))","v":"2023-05-22"},"Segunda",null,null,null,null,null,null,null,0,null,0,null,null,null,0,null,null,null,{"$f":"IF($C30=\"\",0,IF($S30<=VLOOKUP($C30,PREMISSAS!$C$6:$J$13,4,FALSE),$S30,VLOOKUP($C30,PREMISSAS!$C$6:$J$13,4,FALSE)))","v":0},null,{"$f":"IF($C30=\"\",0,IF($S30>VLOOKUP($C30,PREMISSAS!$C$6:$J$13,4,FALSE),$S30-VLOOKUP($C30,PREMISSAS!$C$6:$J$13,4,FALSE),0))","v":0},null,null,null,null,null,"","","","","","",""]
[null,null,3,{"$f":"IF(D30=\"\",\"\",IF((D30+1)>'PERIODOS E FERIADOS'!$G$6,\"\",D30+1))","v":"2023-05-23"},"Terça",null,null,null,null,null,null,null,0,null,0,null,null,null,0,null,null,null,{"$f":"IF($C31=\"\",0,IF($S31<=VLOOKUP($C31,PREMISSAS!$C$6:$J$13,4,FALSE),$S31,VLOOKUP($C31,PREMISSAS!$C$6:$J$13,4,FALSE)))","v":0},null,{"$f":"IF($C31=\"\",0,IF($S31>VLOOKUP($C31,PREMISSAS!$C$6:$J$13,4,FALSE),$S31-VLOOKUP($C31,PREMISSAS!$C$6:$J$13,4,FALSE),0))","v":0},null,null,null,null,null,"","","","","","",""]
[null,null,4,{"$f":"IF(D31=\"\",\"\",IF((D31+1)>'PERIODOS E FERIADOS'!$G$6,\"\",D31+1))","v":"2023-05-24"},"Quarta",null,null,null,null,null,null,null,0,null,0,null,null,null,0,null,null,null,{"$f":"IF($C32=\"\",0,IF($S32<=VLOOKUP($C32,PREMISSAS!$C$6:$J$13,4,FALSE),$S32,VLOOKUP($C32,PREMISSAS!$C$6:$J$13,4,FALSE)))","v":0},null,{"$f":"IF($C32=\"\",0,IF($S32>VLOOKUP($C32,PREMISSAS!$C$6:$J$13,4,FALSE),$S32-VLOOKUP($C32,PREMISSAS!$C$6:$J$13,4,FALSE),0))","v":0},null,null,null,null,null,{"$f":"IF(OR(F32=\"\",F32=0,F32=\"FALTA\",F32=\"SUSPENSO\",F32=\"SUSPENSÃO\"),\"\",TEXT(F32,\"##\"\":\"\"##\"))","v":""},{"$f":"IF(OR(G32=\"\",G32=0,G32=\"FALTA\",G32=\"SUSPENSO\",G32=\"SUSPENSÃO\"),\"\",TEXT(G32,\"##\"\":\"\"##\"))","v":""},"","",{"$f":"IF(OR(J32=\"\",J32=0,J32=\"FALTA\",J32=\"SUSPENSO\",J32=\"SUSPENSÃO\"),\"\",TEXT(J32,\"##\"\":\"\"##\"))","v":""},{"$f":"IF(OR(K32=\"\",K32=0,K32=\"FALTA\",K32=\"SUSPENSO\",K32=\"SUSPENSÃO\"),\"\",TEXT(K32,\"##\"\":\"\"##\"))","v":""},""]
[null,null,5,{"$f":"IF(D32=\"\",\"\",IF((D32+1)>'PERIODOS E FERIADOS'!$G$6,\"\",D32+1))","v":"2023-05-25"},"Quinta",null,null,null,null,null,null,null,0,null,0,null,null,null,0,null,null,null,{"$f":"IF($C33=\"\",0,IF($S33<=VLOOKUP($C33,PREMISSAS!$C$6:$J$13,4,FALSE),$S33,VLOOKUP($C33,PREMISSAS!$C$6:$J$13,4,FALSE)))","v":0},null,{"$f":"IF($C33=\"\",0,IF($S33>VLOOKUP($C33,PREMISSAS!$C$6:$J$13,4,FALSE),$S33-VLOOKUP($C33,PREMISSAS!$C$6:$J$13,4,FALSE),0))","v":0},null,null,null,null,null,{"$f":"IF(OR(F33=\"\",F33=0,F33=\"FALTA\",F33=\"SUSPENSO\",F33=\"SUSPENSÃO\"),\"\",TEXT(F33,\"##\"\":\"\"##\"))","v":""},"","","","","",""]
[null,null,6,{"$f":"IF(D33=\"\",\"\",IF((D33+1)>'PERIODOS E FERIADOS'!$G$6,\"\",D33+1))","v":"2023-05-26"},"Sexta",null,null,null,null,null,null,null,0,null,0,null,null,null,0,null,null,null,{"$f":"IF($C34=\"\",0,IF($S34<=VLOOKUP($C34,PREMISSAS!$C$6:$J$13,4,FALSE),$S34,VLOOKUP($C34,PREMISSAS!$C$6:$J$13,4,FALSE)))","v":0},null,{"$f":"IF($C34=\"\",0,IF($S34>VLOOKUP($C34,PREMISSAS!$C$6:$J$13,4,FALSE),$S34-VLOOKUP($C34,PREMISSAS!$C$6:$J$13,4,FALSE),0))","v":0},null,null,null,null,null,"","","","","","",""]
[null,null,7,{"$f":"IF(D34=\"\",\"\",IF((D34+1)>'PERIODOS E FERIADOS'!$G$6,\"\",D34+1))","v":"2023-05-27"},"Sábado",null,null,null,null,null,null,null,0,null,0,null,null,null,0,null,null,null,{"$f":"IF($C35=\"\",0,IF($S35<=VLOOKUP($C35,PREMISSAS!$C$6:$J$13,4,FALSE),$S35,VLOOKUP($C35,PREMISSAS!$C$6:$J$13,4,FALSE)))","v":0},null,{"$f":"IF($C35=\"\",0,IF($S35>VLOOKUP($C35,PREMISSAS!$C$6:$J$13,4,FALSE),$S35-VLOOKUP($C35,PREMISSAS!$C$6:$J$13,4,FALSE),0))","v":0},null,null,null,null,null,"","","","","","",""]
[null,null,1,{"$f":"IF(D35=\"\",\"\",IF((D35+1)>'PERIODOS E FERIADOS'!$G$6,\"\",D35+1))","v":"2023-05-28"},"Domingo",null,null,null,null,null,null,null,0,null,0,null,null,null,0,null,null,null,{"$f":"IF($C36=\"\",0,IF($S36<=VLOOKUP($C36,PREMISSAS!$C$6:$J$13,4,FALSE),$S36,VLOOKUP($C36,PREMISSAS!$C$6:$J$13,4,FALSE)))","v":0},null,{"$f":"IF($C36=\"\",0,IF($S36>VLOOKUP($C36,PREMISSAS!$C$6:$J$13,4,FALSE),$S36-VLOOKUP($C36,PREMISSAS!$C$6:$J$13,4,FALSE),0))","v":0},null,null,null,null,null,"","","","","","",""]
[null,null,2,{"$f":"IF(D36=\"\",\"\",IF((D36+1)>'PERIODOS E FERIADOS'!$G$6,\"\",D36+1))","v":"2023-05-29"},"Segunda",null,null,null,null,null,null,null,0,null,0,null,null,null,0,null,null,null,{"$f":"IF($C37=\"\",0,IF($S37<=VLOOKUP($C37,PREMISSAS!$C$6:$J$13,4,FALSE),$S37,VLOOKUP($C37,PREMISSAS!$C$6:$J$13,4,FALSE)))","v":0},null,{"$f":"IF($C37=\"\",0,IF($S37>VLOOKUP($C37,PREMISSAS!$C$6:$J$13,4,FALSE),$S37-VLOOKUP($C37,PREMISSAS!$C$6:$J$13,4,FALSE),0))","v":0},null,null,null,null,null,"","","","","","",""]
[null,null,3,{"$f":"IF(D37=\"\",\"\",IF((D37+1)>'PERIODOS E FERIADOS'!$G$6,\"\",D37+1))","v":"2023-05-30"},"Terça",null,null,null,null,null,null,null,0,null,0,null,null,null,0,null,null,null,{"$f":"IF($C38=\"\",0,IF($S38<=VLOOKUP($C38,PREMISSAS!$C$6:$J$13,4,FALSE),$S38,VLOOKUP($C38,PREMISSAS!$C$6:$J$13,4,FALSE)))","v":0},null,{"$f":"IF($C38=\"\",0,IF($S38>VLOOKUP($C38,PREMISSAS!$C$6:$J$13,4,FALSE),$S38-VLOOKUP($C38,PREMISSAS!$C$6:$J$13,4,FALSE),0))","v":0},null,null,null,null,null,"","","","","","",""]
[null,null,4,{"$f":"IF(D38=\"\",\"\",IF((D38+1)>'PERIODOS E FERIADOS'!$G$6,\"\",D38+1))","v":"2023-05-31"},"Quarta",null,null,null,null,null,null,null,0,null,0,null,null,null,0,null,null,null,{"$f":"IF($C39=\"\",0,IF($S39<=VLOOKUP($C39,PREMISSAS!$C$6:$J$13,4,FALSE),$S39,VLOOKUP($C39,PREMISSAS!$C$6:$J$13,4,FALSE)))","v":0},null,{"$f":"IF($C39=\"\",0,IF($S39>VLOOKUP($C39,PREMISSAS!$C$6:$J$13,4,FALSE),$S39-VLOOKUP($C39,PREMISSAS!$C$6:$J$13,4,FALSE),0))","v":0},null,null,null,null,null,"","","","","","",""]
[]
[null,null,null,"TOTAIS",null,null,"Faltas / Suspensão",null,{"$f":"COUNTIF($F$9:$F$39,\"FALTA\")+COUNTIF($F$9:$F$39,\"SUSPENSÃO\")+COUNTIF($F$9:$F$39,\"SUSPENSO\")+COUNTIF($F$9:$F$39,\"SUSPENSAO\")","v":0},null,null,null,{"$f":"SUM($M$9:$M$39)","v":0},null,{"$f":"SUM($O$9:$O$39)","v":0},null,null,null,{"$f":"SUM(S$9:S$39)","v":0},null,{"$f":"$AK$41","v":0},null,{"$f":"SUM(W$9:W$39)","v":0},null,{"$f":"SUM(Y$9:Y$39)","v":0},null,null,null,null,null,null,null,null,null,null,null,{"$f":"SUM(AK9:AK39)","v":0}]
[]
[null,null,null,"OBSERVAÇÕES:"]

{"sheet":"FUNC 19","index":23,"n_rows":43,"n_cols":37,"rows_kept":43,"cut":false,"hidden":false,"merged":[[5,30,5,33],[40,3,40,5],[40,6,40,7],[40,8,40,10],[42,3,43,24],[18,26,18,27],[19,26,19,27],[3,3,4,27],[5,3,5,4],[5,5,5,10],[5,12,5,20],[5,22,5,24],[5,26,5,27]]}
[]
[]
[]
[null,null,null,{"$f":"'PERIODOS E FERIADOS'!$E$5","v":0}]
[]
[null,null,null,"Funcionário",null,{"$f":"FUNCIONÁRIOS!E23","v":19},null,null,null,null,null,null,"H.E. / Atrasos / A.N",null,null,null,null,null,null,null,null,null,"Distrib. H.E. p/ Faixa",null,null,null,"CARGA HORÁRIA",null,null,null,"ESPELHO"]
[]
[null,null,null,"Data","Dia Semana","Entrada","Saída","Entrada","Saída","Entrada","Saída",null,"H. Diária",null,"Atrasos",null,"Abona",null,"Horas Extras",null,"Adc. Noturno",null,{"$f":"PREMISSAS!H6","v":0.5},null,{"$f":"PREMISSAS!H12","v":1},2,"SEGUNDA",0.33333333333333331,2,null,"Entrada","Saída","Entrada","Saída","Entrada","Saída","AN "]
[null,null,{"$f":"IF(NOT(ISERROR(VLOOKUP(D9,rngFeriados,1,FALSE))),\"F\",IF(D9=\"\",\"\",WEEKDAY($D9,1)))","v":"F"},{"$f":"'PERIODOS E FERIADOS'!$E$6","v":"2023-05-01"},{"$f":"IF(D9=\"\",\"\",IF(WEEKDAY(D9,1)=1,\"Domingo\",IF(WEEKDAY(D9,1)=2,\"Segunda\",IF(WEEKDAY(D9,1)=3,\"Terça\",IF(WEEKDAY(D9,1)=4,\"Quarta\",IF(WEEKDAY(D9,1)=5,\"Quinta\",IF(WEEKDAY(D9,1)=6,\"Sexta\",IF(WEEKDAY(D9,1)=7,\"Sábado\"))))))))","v":"Segunda"},null,null,null,null,null,null,null,{"$f":"IF(ISERROR(IF(OR($AF9=\"\",$AF9=0),0,(IF(TEXT($AF9,\"[hh]:mm:ss\")<TEXT($AE9,\"[hh]:mm:ss\"),(1-$AE9+$AF9),$AF9-$AE9))+IF(OR($AH9=\"\",$AH9=0),0,(IF(TEXT($AH9,\"[hh]:mm:ss\")<TEXT($AG9,\"[hh]:mm:ss\"),(1-$AG9+$AH9),$AH9-$AG9))+IF(OR($AJ9=\"\",$AJ9=0),0,(IF(TEXT($AJ9,\"[hh]:mm:ss\")<TEXT($AI9,\"[hh]:mm:ss\"),(1-$AI9+$AJ9),$AJ9-$AI9)))))),0,IF(OR($AF9=\"\",$AF9=0),0,(IF(TEXT($AF9,\"[hh]:mm:ss\")<TEXT($AE9,\"[hh]:mm:ss\"),(1-$AE9+$AF9),$AF9-$AE9))+IF(OR($AH9=\"\",$AH9=0),0,(IF(TEXT($AH9,\"[hh]:mm:ss\")<TEXT($AG9,\"[hh]:mm:ss\"),(1-$AG9+$AH9),$AH9-$AG9))+IF(OR($AJ9=\"\",$AJ9=0),0,(IF(TEXT($AJ9,\"[hh]:mm:ss\")<TEXT($AI9,\"[hh]:mm:ss\"),(1-$AI9+$AJ9),$AJ9-$AI9))))))","v":0},null,{"$f":"IF($C9=\"\",0,IF(Q9=\"Sim\",0,IF(TEXT(IF(OR((VLOOKUP($C9,$Z$8:$AB$15,3,FALSE)-$M9)<0,$AE9=\"\"),0,(VLOOKUP($C9,$Z$8:$AB$15,3,FALSE)-$M9)),\"[hh]:mm\")<=TEXT(rngTolerancia,\"[hh]:mm\"),0,IF(OR((VLOOKUP($C9,$Z$8:$AB$15,3,FALSE)-$M9)<0,$AE9=\"\"),0,(VLOOKUP($C9,$Z$8:$AB$15,3,FALSE)-$M9)))))","v":0},null,null,null,{"$f":"IF($C9=\"\",0,IF(TEXT(IF(($M9-VLOOKUP($C9,$Z$8:$AB$15,3,FALSE))<0,0,($M9-VLOOKUP($C9,$Z$8:$AB$15,3,FALSE))),\"[hh]:mm\")<=TEXT(rngTolerancia,\"[hh]:mm\"),0,IF(($M9-VLOOKUP($C9,$Z$8:$AB$15,3,FALSE))<0,0,($M9-VLOOKUP($C9,$Z$8:$AB$15,3,FALSE)))))","v":0},null,null,null,{"$f":"IF($C9=\"\",0,IF($S9<=VLOOKUP($C9,PREMISSAS!$C$6:$J$13,4,FALSE),$S9,VLOOKUP($C9,PREMISSAS!$C$6:$J$13,4,FALSE)))","v":0},null,{"$f":"IF($C9=\"\",0,IF($S9>VLOOKUP($C9,PREMISSAS!$C$6:$J$13,4,FALSE),$S9-VLOOKUP($C9,PREMISSAS!$C$6:$J$13,4,FALSE),0))","v":0},3,"TERÇA",0.33333333333333331,3,null,{"$f":"IF(OR(F9=\"\",F9=0,F9=\"FALTA\",F9=\"SUSPENSO\",F9=\"SUSPENSÃO\"),\"\",TEXT(F9,\"##\"\":\"\"##\"))","v":""},{"$f":"IF(OR(G9=\"\",G9=0,G9=\"FALTA\",G9=\"SUSPENSO\",G9=\"SUSPENSÃO\"),\"\",TEXT(G9,\"##\"\":\"\"##\"))","v":""},"","",{"$f":"IF(OR(J9=\"\",J9=0,J9=\"FALTA\",J9=\"SUSPENSO\",J9=\"SUSPENSÃO\"),\"\",TEXT(J9,\"##\"\":\"\"##\"))","v":""},{"$f":"IF(OR(K9=\"\",K9=0,K9=\"FALTA\",K9=\"SUSPENSO\",K9=\"SUSPENSÃO\"),\"\",TEXT(K9,\"##\"\":\"\"##\"))","v":""},{"$f":"IF(OR(U9=\"\",U9=0,U9=\"FALTA\",U9=\"SUSPENSO\",U9=\"SUSPENSÃO\"),\"\",TEXT(TEXT(U9,\"00\"\":\"\"00\"),\"[hh]:mm\")*1)","v":""}]
[null,null,3,{"$f":"IF(D9=\"\",\"\",IF((D9+1)>'PERIODOS E FERIADOS'!$G$6,\"\",D9+1))","v":"2023-05-02"},{"$f":"IF(D10=\"\",\"\",IF(WEEKDAY(D10,1)=1,\"Domingo\",IF(WEEKDAY(D10,1)=2,\"Segunda\",IF(WEEKDAY(D10,1)=3,\"Terça\",IF(WEEKDAY(D10,1)=4,\"Quarta\",IF(WEEKDAY(D10,1)=5,\"Quinta\",IF(WEEKDAY(D10,1)=6,\"Sexta\",IF(WEEKDAY(D10,1)=7,\"Sábado\"))))))))","v":"Terça"},null,null,null,null,null,null,null,{"$f":"IF(ISERROR(IF(OR($AF10=\"\",$AF10=0),0,(IF(TEXT($AF10,\"[hh]:mm:ss\")<TEXT($AE10,\"[hh]:mm:ss\"),(1-$AE10+$AF10),$AF10-$AE10))+IF(OR($AH10=\"\",$AH10=0),0,(IF(TEXT($AH10,\"[hh]:mm:ss\")<TEXT($AG10,\"[hh]:mm:ss\"),(1-$AG10+$AH10),$AH10-$AG10))+IF(OR($AJ10=\"\",$AJ10=0),0,(IF(TEXT($AJ10,\"[hh]:mm:ss\")<TEXT($AI10,\"[hh]:mm:ss\"),(1-$AI10+$AJ10),$AJ10-$AI10)))))),0,IF(OR($AF10=\"\",$AF10=0),0,(IF(TEXT($AF10,\"[hh]:mm:ss\")<TEXT($AE10,\"[hh]:mm:ss\"),(1-$AE10+$AF10),$AF10-$AE10))+IF(OR($AH10=\"\",$AH10=0),0,(IF(TEXT($AH10,\"[hh]:mm:ss\")<TEXT($AG10,\"[hh]:mm:ss\"),(1-$AG10+$AH10),$AH10-$AG10))+IF(OR($AJ10=\"\",$AJ10=0),0,(IF(TEXT($AJ10,\"[hh]:mm:ss\")<TEXT($AI10,\"[hh]:mm:ss\"),(1-$AI10+$AJ10),$AJ10-$AI10))))))","v":0},null,{"$f":"IF($C10=\"\",0,IF(Q10=\"Sim\",0,IF(TEXT(IF(OR((VLOOKUP($C10,$Z$8:$AB$15,3,FALSE)-$M10)<0,$AE10=\"\"),0,(VLOOKUP($C10,$Z$8:$AB$15,3,FALSE)-$M10)),\"[hh]:mm\")<=TEXT(rngTolerancia,\"[hh]:mm\"),0,IF(OR((VLOOKUP($C10,$Z$8:$AB$15,3,FALSE)-$M10)<0,$AE10=\"\"),0,(VLOOKUP($C10,$Z$8:$AB$15,3,FALSE)-$M10)))))","v":0},null,null,null,0,null,null,null,{"$f":"IF($C10=\"\",0,IF($S10<=VLOOKUP($C10,PREMISSAS!$C$6:$J$13,4,FALSE),$S10,VLOOKUP($C10,PREMISSAS!$C$6:$J$13,4,FALSE)))","v":0},null,{"$f":"IF($C10=\"\",0,IF($S10>VLOOKUP($C10,PREMISSAS!$C$6:$J$13,4,FALSE),$S10-VLOOKUP($C10,PREMISSAS!$C$6:$J$13,4,FALSE),0))","v":0},4,"QUARTA",0.33333333333333331,4,null,{"$f":"IF(OR(F10=\"\",F10=0,F10=\"FALTA\",F10=\"SUSPENSO\",F10=\"SUSPENSÃO\"),\"\",TEXT(F10,\"##\"\":\"\"##\"))","v":""},"","","","","",{"$f":"IF(OR(U10=\"\",U10=0,U10=\"FALTA\",U10=\"SUSPENSO\",U10=\"SUSPENSÃO\"),\"\",TEXT(TEXT(U10,\"00\"\":\"\"00\"),\"[hh]:mm\")*1)","v":""}]
[null,null,4,{"$f":"IF(D10=\"\",\"\",IF((D10+1)>'PERIODOS E FERIADOS'!$G$6,\"\",D10+1))","v":"2023-05-03"},"Quarta",null,null,null,null,null,null,null,0,null,0,null,null,null,0,null,null,null,{"$f":"IF($C11=\"\",0,IF($S11<=VLOOKUP($C11,PREMISSAS!$C$6:$J$13,4,FALSE),$S11,VLOOKUP($C11,PREMISSAS!$C$6:$J$13,4,FALSE)))","v":0},null,{"$f":"IF($C11=\"\",0,IF($S11>VLOOKUP($C11,PREMISSAS!$C$6:$J$13,4,FALSE),$S11-VLOOKUP($C11,PREMISSAS!$C$6:$J$13,4,FALSE),0))","v":0},5,"QUINTA",0.33333333333333331,5,null,"","","","","","",""]
[null,null,5,{"$f":"IF(D11=\"\",\"\",IF((D11+1)>'PERIODOS E FERIADOS'!$G$6,\"\",D11+1))","v":"2023-05-04"},"Quinta",null,null,null,null,null,null,null,0,null,0,null,null,null,0,null,null,null,{"$f":"IF($C12=\"\",0,IF($S12<=VLOOKUP($C12,PREMISSAS!$C$6:$J$13,4,FALSE),$S12,VLOOKUP($C12,PREMISSAS!$C$6:$J$13,4,FALSE)))","v":0},null,{"$f":"IF($C12=\"\",0,IF($S12>VLOOKUP($C12,PREMISSAS!$C$6:$J$13,4,FALSE),$S12-VLOOKUP($C12,PREMISSAS!$C$6:$J$13,4,FALSE),0))","v":0},6,"SEXTA",0.33333333333333331,6,null,"","","","","","",{"$f":"IF(OR(U12=\"\",U12=0,U12=\"FALTA\",U12=\"SUSPENSO\",U12=\"SUSPENSÃO\"),\"\",TEXT(TEXT(U12,\"##\"\":\"\"##\"),\"[hh]:mm\")*1)","v":""}]
[null,null,6,{"$f":"IF(D12=\"\",\"\",IF((D12+1)>'PERIODOS E FERIADOS'!$G$6,\"\",D12+1))","v":"2023-05-05"},"Sexta",null,null,null,null,null,null,null,0,null,0,null,null,null,0,null,null,null,{"$f":"IF($C13=\"\",0,IF($S13<=VLOOKUP($C13,PREMISSAS!$C$6:$J$13,4,FALSE),$S13,VLOOKUP($C13,PREMISSAS!$C$6:$J$13,4,FALSE)))","v":0},null,{"$f":"IF($C13=\"\",0,IF($S13>VLOOKUP($C13,PREMISSAS!$C$6:$J$13,4,FALSE),$S13-VLOOKUP($C13,PREMISSAS!$C$6:$J$13,4,FALSE),0))","v":0},7,"SÁBADO",0.16666666666666666,7,null,"","","","","","",""]
[null,null,7,{"$f":"IF(D13=\"\",\"\",IF((D13+1)>'PERIODOS E FERIADOS'!$G$6,\"\",D13+1))","v":"2023-05-06"},"Sábado",null,null,null,null,null,null,null,0,null,0,null,null,null,0,null,null,null,{"$f":"IF($C14=\"\",0,IF($S14<=VLOOKUP($C14,PREMISSAS!$C$6:$J$13,4,FALSE),$S14,VLOOKUP($C14,PREMISSAS!$C$6:$J$13,4,FALSE)))","v":0},null,{"$f":"IF($C14=\"\",0,IF($S14>VLOOKUP($C14,PREMISSAS!$C$6:$J$13,4,FALSE),$S14-VLOOKUP($C14,PREMISSAS!$C$6:$J$13,4,FALSE),0))","v":0},1,"DOMINGO",0,1,null,"","","","","","",""]
[null,null,1,{"$f":"IF(D14=\"\",\"\",IF((D14+1)>'PERIODOS E FERIADOS'!$G$6,\"\",D14+1))","v":"2023-05-07"},"Domingo",null,null,null,null,null,null,null,0,null,0,null,null,null,0,null,null,null,{"$f":"IF($C15=\"\",0,IF($S15<=VLOOKUP($C15,PREMISSAS!$C$6:$J$13,4,FALSE),$S15,VLOOKUP($C15,PREMISSAS!$C$6:$J$13,4,FALSE)))","v":0},null,{"$f":"IF($C15=\"\",0,IF($S15>VLOOKUP($C15,PREMISSAS!$C$6:$J$13,4,FALSE),$S15-VLOOKUP($C15,PREMISSAS!$C$6:$J$13,4,FALSE),0))","v":0},"F","FERIADOS",0,"F",null,"","","","","","",""]
[null,null,2,{"$f":"IF(D15=\"\",\"\",IF((D15+1)>'PERIODOS E FERIADOS'!$G$6,\"\",D15+1))","v":"2023-05-08"},"Segunda",null,null,null,null,null,null,null,0,null,0,null,null,null,0,null,null,null,{"$f":"IF($C16=\"\",0,IF($S16<=VLOOKUP($C16,PREMISSAS!$C$6:$J$13,4,FALSE),$S16,VLOOKUP($C16,PREMISSAS!$C$6:$J$13,4,FALSE)))","v":0},null,{"$f":"IF($C16=\"\",0,IF($S16>VLOOKUP($C16,PREMISSAS!$C$6:$J$13,4,FALSE),$S16-VLOOKUP($C16,PREMISSAS!$C$6:$J$13,4,FALSE),0))","v":0},null,"TOTAL SEMANA",{"$f":"SUM(AB8:AB15)","v":1.8333333333333333},null,null,"","","","","","",""]
[null,null,3,{"$f":"IF(D16=\"\",\"\",IF((D16+1)>'PERIODOS E FERIADOS'!$G$6,\"\",D16+1))","v":"2023-05-09"},"Terça",null,null,null,null,null,null,null,0,null,0,null,null,null,0,null,null,null,{"$f":"IF($C17=\"\",0,IF($S17<=VLOOKUP($C17,PREMISSAS!$C$6:$J$13,4,FALSE),$S17,VLOOKUP($C17,PREMISSAS!$C$6:$J$13,4,FALSE)))","v":0},null,{"$f":"IF($C17=\"\",0,IF($S17>VLOOKUP($C17,PREMISSAS!$C$6:$J$13,4,FALSE),$S17-VLOOKUP($C17,PREMISSAS!$C$6:$J$13,4,FALSE),0))","v":0},null,"JORNADA MENSAL",{"$f":"AB16*5","v":9.1666666666666661},null,null,"","","","","","",""]
[null,null,4,{"$f":"IF(D17=\"\",\"\",IF((D17+1)>'PERIODOS E FERIADOS'!$G$6,\"\",D17+1))","v":"2023-05-10"},"Quarta",null,null,null,null,null,null,null,0,null,0,null,null,null,0,null,null,null,{"$f":"IF($C18=\"\",0,IF($S18<=VLOOKUP($C18,PREMISSAS!$C$6:$J$13,4,FALSE),$S18,VLOOKUP($C18,PREMISSAS!$C$6:$J$13,4,FALSE)))","v":0},null,{"$f":"IF($C18=\"\",0,IF($S18>VLOOKUP($C18,PREMISSAS!$C$6:$J$13,4,FALSE),$S18-VLOOKUP($C18,PREMISSAS!$C$6:$J$13,4,FALSE),0))","v":0},null,null,null,null,null,"","","","","","",""]
[null,null,5,{"$f":"IF(D18=\"\",\"\",IF((D18+1)>'PERIODOS E FERIADOS'!$G$6,\"\",D18+1))","v":"2023-05-11"},"Quinta",null,null,null,null,null,null,null,0,null,0,null,null,null,0,null,null,null,{"$f":"IF($C19=\"\",0,IF($S19<=VLOOKUP($C19,PREMISSAS!$C$6:$J$13,4,FALSE),$S19,VLOOKUP($C19,PREMISSAS!$C$6:$J$13,4,FALSE)))","v":0},null,{"$f":"IF($C19=\"\",0,IF($S19>VLOOKUP($C19,PREMISSAS!$C$6:$J$13,4,FALSE),$S19-VLOOKUP($C19,PREMISSAS!$C$6:$J$13,4,FALSE),0))","v":0},null,{"$f":"IF(AB$16>AB$23,\"Jornada Superior a permitida\",IF(AB$16<=AB$23,\"\"))","v":""},null,null,null,"","","","","","",""]
[null,null,6,{"$f":"IF(D19=\"\",\"\",IF((D19+1)>'PERIODOS E FERIADOS'!$G$6,\"\",D19+1))","v":"2023-05-12"},"Sexta",null,null,null,null,null,null,null,0,null,0,null,null,null,0,null,null,null,{"$f":"IF($C20=\"\",0,IF($S20<=VLOOKUP($C20,PREMISSAS!$C$6:$J$13,4,FALSE),$S20,VLOOKUP($C20,PREMISSAS!$C$6:$J$13,4,FALSE)))","v":0},null,{"$f":"IF($C20=\"\",0,IF($S20>VLOOKUP($C20,PREMISSAS!$C$6:$J$13,4,FALSE),$S20-VLOOKUP($C20,PREMISSAS!$C$6:$J$13,4,FALSE),0))","v":0},null,{"$f":"IF(AB$16>AB$23,\"\",IF(AB$16<=AB$23,\"Jornada Ok\"))","v":"Jornada Ok"},null,null,null,"","","","","","",""]
[null,null,7,{"$f":"IF(D20=\"\",\"\",IF((D20+1)>'PERIODOS E FERIADOS'!$G$6,\"\",D20+1))","v":"2023-05-13"},"Sábado",null,null,null,null,null,null,null,0,null,0,null,null,null,0,null,null,null,{"$f":"IF($C21=\"\",0,IF($S21<=VLOOKUP($C21,PREMISSAS!$C$6:$J$13,4,FALSE),$S21,VLOOKUP($C21,PREMISSAS!$C$6:$J$13,4,FALSE)))","v":0},null,{"$f":"IF($C21=\"\",0,IF($S21>VLOOKUP($C21,PREMISSAS!$C$6:$J$13,4,FALSE),$S21-VLOOKUP($C21,PREMISSAS!$C$6:$J$13,4,FALSE),0))","v":0},null,null,null,null,null,"","","","","","",""]
[null,null,1,{"$f":"IF(D21=\"\",\"\",IF((D21+1)>'PERIODOS E FERIADOS'!$G$6,\"\",D21+1))","v":"2023-05-14"},"Domingo",null,null,null,null,null,null,null,0,null,0,null,null,null,0,null,null,null,{"$f":"IF($C22=\"\",0,IF($S22<=VLOOKUP($C22,PREMISSAS!$C$6:$J$13,4,FALSE),$S22,VLOOKUP($C22,PREMISSAS!$C$6:$J$13,4,FALSE)))","v":0},null,{"$f":"IF($C22=\"\",0,IF($S22>VLOOKUP($C22,PREMISSAS!$C$6:$J$13,4,FALSE),$S22-VLOOKUP($C22,PREMISSAS!$C$6:$J$13,4,FALSE),0))","v":0},null,null,null,null,null,"","","","","","",""]
[null,null,2,{"$f":"IF(D22=\"\",\"\",IF((D22+1)>'PERIODOS E FERIADOS'!$G$6,\"\",D22+1))","v":"2023-05-15"},"Segunda",null,null,null,null,null,null,null,0,null,0,null,null,null,0,null,null,null,{"$f":"IF($C23=\"\",0,IF($S23<=VLOOKUP($C23,PREMISSAS!$C$6:$J$13,4,FALSE),$S23,VLOOKUP($C23,PREMISSAS!$C$6:$J$13,4,FALSE)))","v":0},null,{"$f":"IF($C23=\"\",0,IF($S23>VLOOKUP($C23,PREMISSAS!$C$6:$J$13,4,FALSE),$S23-VLOOKUP($C23,PREMISSAS!$C$6:$J$13,4,FALSE),0))","v":0},null,"Jornada Maxima",1.8333333333333333,null,null,"","","","","","",""]
[null,null,3,{"$f":"IF(D23=\"\",\"\",IF((D23+1)>'PERIODOS E FERIADOS'!$G$6,\"\",D23+1))","v":"2023-05-16"},"Terça",null,null,null,null,null,null,null,0,null,0,null,null,null,0,null,null,null,{"$f":"IF($C24=\"\",0,IF($S24<=VLOOKUP($C24,PREMISSAS!$C$6:$J$13,4,FALSE),$S24,VLOOKUP($C24,PREMISSAS!$C$6:$J$13,4,FALSE)))","v":0},null,{"$f":"IF($C24=\"\",0,IF($S24>VLOOKUP($C24,PREMISSAS!$C$6:$J$13,4,FALSE),$S24-VLOOKUP($C24,PREMISSAS!$C$6:$J$13,4,FALSE),0))","v":0},null,null,null,null,null,"","","","","","",""]
[null,null,4,{"$f":"IF(D24=\"\",\"\",IF((D24+1)>'PERIODOS E FERIADOS'!$G$6,\"\",D24+1))","v":"2023-05-17"},"Quarta",null,null,null,null,null,null,null,0,null,0,null,null,null,0,null,null,null,{"$f":"IF($C25=\"\",0,IF($S25<=VLOOKUP($C25,PREMISSAS!$C$6:$J$13,4,FALSE),$S25,VLOOKUP($C25,PREMISSAS!$C$6:$J$13,4,FALSE)))","v":0},null,{"$f":"IF($C25=\"\",0,IF($S25>VLOOKUP($C25,PREMISSAS!$C$6:$J$13,4,FALSE),$S25-VLOOKUP($C25,PREMISSAS!$C$6:$J$13,4,FALSE),0))","v":0},null,null,null,null,null,"","","","","","",""]
[null,null,5,{"$f":"IF(D25=\"\",\"\",IF((D25+1)>'PERIODOS E FERIADOS'!$G$6,\"\",D25+1))","v":"2023-05-18"},"Quinta",null,null,null,null,null,null,null,0,null,0,null,null,null,0,null,null,null,{"$f":"IF($C26=\"\",0,IF($S26<=VLOOKUP($C26,PREMISSAS!$C$6:$J$13,4,FALSE),$S26,VLOOKUP($C26,PREMISSAS!$C$6:$J$13,4,FALSE)))","v":0},null,{"$f":"IF($C26=\"\",0,IF($S26>VLOOKUP($C26,PREMISSAS!$C$6:$J$13,4,FALSE),$S26-VLOOKUP($C26,PREMISSAS!$C$6:$J$13,4,FALSE),0))","v":0},null,null,null,null,null,"","","","","","",""]
[null,null,6,{"$f":"IF(D26=\"\",\"\",IF((D26+1)>'PERIODOS E FERIADOS'!$G$6,\"\",D26+1))","v":"2023-05-19"},"Sexta",null,null,null,null,null,null,null,0,null,0,null,null,null,0,null,null,null,{"$f":"IF($C27=\"\",0,IF($S27<=VLOOKUP($C27,PREMISSAS!$C$6:$J$13,4,FALSE),$S27,VLOOKUP($C27,PREMISSAS!$C$6:$J$13,4,FALSE)))","v":0},null,{"$f":"IF($C27=\"\",0,IF($S27>VLOOKUP($C27,PREMISSAS!$C$6:$J$13,4,FALSE),$S27-VLOOKUP($C27,PREMISSAS!$C$6:$J$13,4,FALSE),0))","v":0},null,null,null,null,null,"","","","","","",""]
[null,null,7,{"$f":"IF(D27=\"\",\"\",IF((D27+1)>'PERIODOS E FERIADOS'!$G$6,\"\",D27+1))","v":"2023-05-20"},"Sábado",null,null,null,null,null,null,null,0,null,0,null,null,null,0,null,null,null,{"$f":"IF($C28=\"\",0,IF($S28<=VLOOKUP($C28,PREMISSAS!$C$6:$J$13,4,FALSE),$S28,VLOOKUP($C28,PREMISSAS!$C$6:$J$13,4,FALSE)))","v":0},null,{"$f":"IF($C28=\"\",0,IF($S28>VLOOKUP($C28,PREMISSAS!$C$6:$J$13,4,FALSE),$S28-VLOOKUP($C28,PREMISSAS!$C$6:$J$13,4,FALSE),0))","v":0},null,null,null,null,null,"","","","","","",""]
[null,null,1,{"$f":"IF(D28=\"\",\"\",IF((D28+1)>'PERIODOS E FERIADOS'!$G$6,\"\",D28+1))","v":"2023-05-21"},"Domingo",null,null,null,null,null,null,null,0,null,0,null,null,null,0,null,null,null,{"$f":"IF($C29=\"\",0,IF($S29<=VLOOKUP($C29,PREMISSAS!$C$6:$J$13,4,FALSE),$S29,VLOOKUP($C29,PREMISSAS!$C$6:$J$13,4,FALSE)))","v":0},null,{"$f":"IF($C29=\"\",0,IF($S29>VLOOKUP($C29,PREMISSAS!$C$6:$J$13,4,FALSE),$S29-VLOOKUP($C29,PREMISSAS!$C$6:$J$13,4,FALSE),0))","v":0},null,null,null,null,null,"","","","","","",""]
[null,null,2,{"$f":"IF(D29=\"\",\"\",IF((D29+1)>'PERIODOS E FERIADOS'!$G$6,\"\",D29+1))","v":"2023-05-22"},"Segunda",null,null,null,null,null,null,null,0,null,0,null,null,null,0,null,null,null,{"$f":"IF($C30=\"\",0,IF($S30<=VLOOKUP($C30,PREMISSAS!$C$6:$J$13,4,FALSE),$S30,VLOOKUP($C30,PREMISSAS!$C$6:$J$13,4,FALSE)))","v":0},null,{"$f":"IF($C30=\"\",0,IF($S30>VLOOKUP($C30,PREMISSAS!$C$6:$J$13,4,FALSE),$S30-VLOOKUP($C30,PREMISSAS!$C$6:$J$13,4,FALSE),0))","v":0},null,null,null,null,null,"","","","","","",""]
[null,null,3,{"$f":"IF(D30=\"\",\"\",IF((D30+1)>'PERIODOS E FERIADOS'!$G$6,\"\",D30+1))","v":"2023-05-23"},"Terça",null,null,null,null,null,null,null,0,null,0,null,null,null,0,null,null,null,{"$f":"IF($C31=\"\",0,IF($S31<=VLOOKUP($C31,PREMISSAS!$C$6:$J$13,4,FALSE),$S31,VLOOKUP($C31,PREMISSAS!$C$6:$J$13,4,FALSE)))","v":0},null,{"$f":"IF($C31=\"\",0,IF($S31>VLOOKUP($C31,PREMISSAS!$C$6:$J$13,4,FALSE),$S31-VLOOKUP($C31,PREMISSAS!$C$6:$J$13,4,FALSE),0))","v":0},null,null,null,null,null,"","","","","","",""]
[null,null,4,{"$f":"IF(D31=\"\",\"\",IF((D31+1)>'PERIODOS E FERIADOS'!$G$6,\"\",D31+1))","v":"2023-05-24"},"Quarta",null,null,null,null,null,null,null,0,null,0,null,null,null,0,null,null,null,{"$f":"IF($C32=\"\",0,IF($S32<=VLOOKUP($C32,PREMISSAS!$C$6:$J$13,4,FALSE),$S32,VLOOKUP($C32,PREMISSAS!$C$6:$J$13,4,FALSE)))","v":0},null,{"$f":"IF($C32=\"\",0,IF($S32>VLOOKUP($C32,PREMISSAS!$C$6:$J$13,4,FALSE),$S32-VLOOKUP($C32,PREMISSAS!$C$6:$J$13,4,FALSE),0))","v":0},null,null,null,null,null,{"$f":"IF(OR(F32=\"\",F32=0,F32=\"FALTA\",F32=\"SUSPENSO\",F32=\"SUSPENSÃO\"),\"\",TEXT(F32,\"##\"\":\"\"##\"))","v":""},{"$f":"IF(OR(G32=\"\",G32=0,G32=\"FALTA\",G32=\"SUSPENSO\",G32=\"SUSPENSÃO\"),\"\",TEXT(G32,\"##\"\":\"\"##\"))","v":""},"","",{"$f":"IF(OR(J32=\"\",J32=0,J32=\"FALTA\",J32=\"SUSPENSO\",J32=\"SUSPENSÃO\"),\"\",TEXT(J32,\"##\"\":\"\"##\"))","v":""},{"$f":"IF(OR(K32=\"\",K32=0,K32=\"FALTA\",K32=\"SUSPENSO\",K32=\"SUSPENSÃO\"),\"\",TEXT(K32,\"##\"\":\"\"##\"))","v":""},""]
[null,null,5,{"$f":"IF(D32=\"\",\"\",IF((D32+1)>'PERIODOS E FERIADOS'!$G$6,\"\",D32+1))","v":"2023-05-25"},"Quinta",null,null,null,null,null,null,null,0,null,0,null,null,null,0,null,null,null,{"$f":"IF($C33=\"\",0,IF($S33<=VLOOKUP($C33,PREMISSAS!$C$6:$J$13,4,FALSE),$S33,VLOOKUP($C33,PREMISSAS!$C$6:$J$13,4,FALSE)))","v":0},null,{"$f":"IF($C33=\"\",0,IF($S33>VLOOKUP($C33,PREMISSAS!$C$6:$J$13,4,FALSE),$S33-VLOOKUP($C33,PREMISSAS!$C$6:$J$13,4,FALSE),0))","v":0},null,null,null,null,null,{"$f":"IF(OR(F33=\"\",F33=0,F33=\"FALTA\",F33=\"SUSPENSO\",F33=\"SUSPENSÃO\"),\"\",TEXT(F33,\"##\"\":\"\"##\"))","v":""},"","","","","",""]
[null,null,6,{"$f":"IF(D33=\"\",\"\",IF((D33+1)>'PERIODOS E FERIADOS'!$G$6,\"\",D33+1))","v":"2023-05-26"},"Sexta",null,null,null,null,null,null,null,0,null,0,null,null,null,0,null,null,null,{"$f":"IF($C34=\"\",0,IF($S34<=VLOOKUP($C34,PREMISSAS!$C$6:$J$13,4,FALSE),$S34,VLOOKUP($C34,PREMISSAS!$C$6:$J$13,4,FALSE)))","v":0},null,{"$f":"IF($C34=\"\",0,IF($S34>VLOOKUP($C34,PREMISSAS!$C$6:$J$13,4,FALSE),$S34-VLOOKUP($C34,PREMISSAS!$C$6:$J$13,4,FALSE),0))","v":0},null,null,null,null,null,"","","","","","",""]
[null,null,7,{"$f":"IF(D34=\"\",\"\",IF((D34+1)>'PERIODOS E FERIADOS'!$G$6,\"\",D34+1))","v":"2023-05-27"},"Sábado",null,null,null,null,null,null,null,0,null,0,null,null,null,0,null,null,null,{"$f":"IF($C35=\"\",0,IF($S35<=VLOOKUP($C35,PREMISSAS!$C$6:$J$13,4,FALSE),$S35,VLOOKUP($C35,PREMISSAS!$C$6:$J$13,4,FALSE)))","v":0},null,{"$f":"IF($C35=\"\",0,IF($S35>VLOOKUP($C35,PREMISSAS!$C$6:$J$13,4,FALSE),$S35-VLOOKUP($C35,PREMISSAS!$C$6:$J$13,4,FALSE),0))","v":0},null,null,null,null,null,"","","","","","",""]
[null,null,1,{"$f":"IF(D35=\"\",\"\",IF((D35+1)>'PERIODOS E FERIADOS'!$G$6,\"\",D35+1))","v":"2023-05-28"},"Domingo",null,null,null,null,null,null,null,0,null,0,null,null,null,0,null,null,null,{"$f":"IF($C36=\"\",0,IF($S36<=VLOOKUP($C36,PREMISSAS!$C$6:$J$13,4,FALSE),$S36,VLOOKUP($C36,PREMISSAS!$C$6:$J$13,4,FALSE)))","v":0},null,{"$f":"IF($C36=\"\",0,IF($S36>VLOOKUP($C36,PREMISSAS!$C$6:$J$13,4,FALSE),$S36-VLOOKUP($C36,PREMISSAS!$C$6:$J$13,4,FALSE),0))","v":0},null,null,null,null,null,"","","","","","",""]
[null,null,2,{"$f":"IF(D36=\"\",\"\",IF((D36+1)>'PERIODOS E FERIADOS'!$G$6,\"\",D36+1))","v":"2023-05-29"},"Segunda",null,null,null,null,null,null,null,0,null,0,null,null,null,0,null,null,null,{"$f":"IF($C37=\"\",0,IF($S37<=VLOOKUP($C37,PREMISSAS!$C$6:$J$13,4,FALSE),$S37,VLOOKUP($C37,PREMISSAS!$C$6:$J$13,4,FALSE)))","v":0},null,{"$f":"IF($C37=\"\",0,IF($S37>VLOOKUP($C37,PREMISSAS!$C$6:$J$13,4,FALSE),$S37-VLOOKUP($C37,PREMISSAS!$C$6:$J$13,4,FALSE),0))","v":0},null,null,null,null,null,"","","","","","",""]
[null,null,3,{"$f":"IF(D37=\"\",\"\",IF((D37+1)>'PERIODOS E FERIADOS'!$G$6,\"\",D37+1))","v":"2023-05-30"},"Terça",null,null,null,null,null,null,null,0,null,0,null,null,null,0,null,null,null,{"$f":"IF($C38=\"\",0,IF($S38<=VLOOKUP($C38,PREMISSAS!$C$6:$J$13,4,FALSE),$S38,VLOOKUP($C38,PREMISSAS!$C$6:$J$13,4,FALSE)))","v":0},null,{"$f":"IF($C38=\"\",0,IF($S38>VLOOKUP($C38,PREMISSAS!$C$6:$J$13,4,FALSE),$S38-VLOOKUP($C38,PREMISSAS!$C$6:$J$13,4,FALSE),0))","v":0},null,null,null,null,null,"","","","","","",""]
[null,null,4,{"$f":"IF(D38=\"\",\"\",IF((D38+1)>'PERIODOS E FERIADOS'!$G$6,\"\",D38+1))","v":"2023-05-31"},"Quarta",null,null,null,null,null,null,null,0,null,0,null,null,null,0,null,null,null,{"$f":"IF($C39=\"\",0,IF($S39<=VLOOKUP($C39,PREMISSAS!$C$6:$J$13,4,FALSE),$S39,VLOOKUP($C39,PREMISSAS!$C$6:$J$13,4,FALSE)))","v":0},null,{"$f":"IF($C39=\"\",0,IF($S39>VLOOKUP($C39,PREMISSAS!$C$6:$J$13,4,FALSE),$S39-VLOOKUP($C39,PREMISSAS!$C$6:$J$13,4,FALSE),0))","v":0},null,null,null,null,null,"","","","","","",""]
[]
[null,null,null,"TOTAIS",null,null,"Faltas / Suspensão",null,{"$f":"COUNTIF($F$9:$F$39,\"FALTA\")+COUNTIF($F$9:$F$39,\"SUSPENSÃO\")+COUNTIF($F$9:$F$39,\"SUSPENSO\")+COUNTIF($F$9:$F$39,\"SUSPENSAO\")","v":0},null,null,null,{"$f":"SUM($M$9:$M$39)","v":0},null,{"$f":"SUM($O$9:$O$39)","v":0},null,null,null,{"$f":"SUM(S$9:S$39)","v":0},null,{"$f":"$AK$41","v":0},null,{"$f":"SUM(W$9:W$39)","v":0},null,{"$f":"SUM(Y$9:Y$39)","v":0},null,null,null,null,null,null,null,null,null,null,null,{"$f":"SUM(AK9:AK39)","v":0}]
[]
[null,null,null,"OBSERVAÇÕES:"]

{"sheet":"FUNC 20","index":24,"n_rows":43,"n_cols":37,"rows_kept":43,"cut":false,"hidden":false,"merged":[[5,30,5,33],[40,3,40,5],[40,6,40,7],[40,8,40,10],[42,3,43,24],[18,26,18,27],[19,26,19,27],[3,3,4,27],[5,3,5,4],[5,5,5,10],[5,12,5,20],[5,22,5,24],[5,26,5,27]]}
[]
[]
[]
[null,null,null,{"$f":"'PERIODOS E FERIADOS'!$E$5","v":0}]
[]
[null,null,null,"Funcionário",null,{"$f":"FUNCIONÁRIOS!E24","v":20},null,null,null,null,null,null,"H.E. / Atrasos / A.N",null,null,null,null,null,null,null,null,null,"Distrib. H.E. p/ Faixa",null,null,null,"CARGA HORÁRIA",null,null,null,"ESPELHO"]
[]
[null,null,null,"Data","Dia Semana","Entrada","Saída","Entrada","Saída","Entrada","Saída",null,"H. Diária",null,"Atrasos",null,"Abona",null,"Horas Extras",null,"Adc. Noturno",null,{"$f":"PREMISSAS!H6","v":0.5},null,{"$f":"PREMISSAS!H12","v":1},2,"SEGUNDA",0.33333333333333331,2,null,"Entrada","Saída","Entrada","Saída","Entrada","Saída","AN "]
[null,null,{"$f":"IF(NOT(ISERROR(VLOOKUP(D9,rngFeriados,1,FALSE))),\"F\",IF(D9=\"\",\"\",WEEKDAY($D9,1)))","v":"F"},{"$f":"'PERIODOS E FERIADOS'!$E$6","v":"2023-05-01"},{"$f":"IF(D9=\"\",\"\",IF(WEEKDAY(D9,1)=1,\"Domingo\",IF(WEEKDAY(D9,1)=2,\"Segunda\",IF(WEEKDAY(D9,1)=3,\"Terça\",IF(WEEKDAY(D9,1)=4,\"Quarta\",IF(WEEKDAY(D9,1)=5,\"Quinta\",IF(WEEKDAY(D9,1)=6,\"Sexta\",IF(WEEKDAY(D9,1)=7,\"Sábado\"))))))))","v":"Segunda"},null,null,null,null,null,null,null,{"$f":"IF(ISERROR(IF(OR($AF9=\"\",$AF9=0),0,(IF(TEXT($AF9,\"[hh]:mm:ss\")<TEXT($AE9,\"[hh]:mm:ss\"),(1-$AE9+$AF9),$AF9-$AE9))+IF(OR($AH9=\"\",$AH9=0),0,(IF(TEXT($AH9,\"[hh]:mm:ss\")<TEXT($AG9,\"[hh]:mm:ss\"),(1-$AG9+$AH9),$AH9-$AG9))+IF(OR($AJ9=\"\",$AJ9=0),0,(IF(TEXT($AJ9,\"[hh]:mm:ss\")<TEXT($AI9,\"[hh]:mm:ss\"),(1-$AI9+$AJ9),$AJ9-$AI9)))))),0,IF(OR($AF9=\"\",$AF9=0),0,(IF(TEXT($AF9,\"[hh]:mm:ss\")<TEXT($AE9,\"[hh]:mm:ss\"),(1-$AE9+$AF9),$AF9-$AE9))+IF(OR($AH9=\"\",$AH9=0),0,(IF(TEXT($AH9,\"[hh]:mm:ss\")<TEXT($AG9,\"[hh]:mm:ss\"),(1-$AG9+$AH9),$AH9-$AG9))+IF(OR($AJ9=\"\",$AJ9=0),0,(IF(TEXT($AJ9,\"[hh]:mm:ss\")<TEXT($AI9,\"[hh]:mm:ss\"),(1-$AI9+$AJ9),$AJ9-$AI9))))))","v":0},null,{"$f":"IF($C9=\"\",0,IF(Q9=\"Sim\",0,IF(TEXT(IF(OR((VLOOKUP($C9,$Z$8:$AB$15,3,FALSE)-$M9)<0,$AE9=\"\"),0,(VLOOKUP($C9,$Z$8:$AB$15,3,FALSE)-$M9)),\"[hh]:mm\")<=TEXT(rngTolerancia,\"[hh]:mm\"),0,IF(OR((VLOOKUP($C9,$Z$8:$AB$15,3,FALSE)-$M9)<0,$AE9=\"\"),0,(VLOOKUP($C9,$Z$8:$AB$15,3,FALSE)-$M9)))))","v":0},null,null,null,{"$f":"IF($C9=\"\",0,IF(TEXT(IF(($M9-VLOOKUP($C9,$Z$8:$AB$15,3,FALSE))<0,0,($M9-VLOOKUP($C9,$Z$8:$AB$15,3,FALSE))),\"[hh]:mm\")<=TEXT(rngTolerancia,\"[hh]:mm\"),0,IF(($M9-VLOOKUP($C9,$Z$8:$AB$15,3,FALSE))<0,0,($M9-VLOOKUP($C9,$Z$8:$AB$15,3,FALSE)))))","v":0},null,null,null,{"$f":"IF($C9=\"\",0,IF($S9<=VLOOKUP($C9,PREMISSAS!$C$6:$J$13,4,FALSE),$S9,VLOOKUP($C9,PREMISSAS!$C$6:$J$13,4,FALSE)))","v":0},null,{"$f":"IF($C9=\"\",0,IF($S9>VLOOKUP($C9,PREMISSAS!$C$6:$J$13,4,FALSE),$S9-VLOOKUP($C9,PREMISSAS!$C$6:$J$13,4,FALSE),0))","v":0},3,"TERÇA",0.33333333333333331,3,null,{"$f":"IF(OR(F9=\"\",F9=0,F9=\"FALTA\",F9=\"SUSPENSO\",F9=\"SUSPENSÃO\"),\"\",TEXT(F9,\"##\"\":\"\"##\"))","v":""},"","","","","",{"$f":"IF(OR(U9=\"\",U9=0,U9=\"FALTA\",U9=\"SUSPENSO\",U9=\"SUSPENSÃO\"),\"\",TEXT(TEXT(U9,\"00\"\":\"\"00\"),\"[hh]:mm\")*1)","v":""}]
[null,null,3,{"$f":"IF(D9=\"\",\"\",IF((D9+1)>'PERIODOS E FERIADOS'!$G$6,\"\",D9+1))","v":"2023-05-02"},{"$f":"IF(D10=\"\",\"\",IF(WEEKDAY(D10,1)=1,\"Domingo\",IF(WEEKDAY(D10,1)=2,\"Segunda\",IF(WEEKDAY(D10,1)=3,\"Terça\",IF(WEEKDAY(D10,1)=4,\"Quarta\",IF(WEEKDAY(D10,1)=5,\"Quinta\",IF(WEEKDAY(D10,1)=6,\"Sexta\",IF(WEEKDAY(D10,1)=7,\"Sábado\"))))))))","v":"Terça"},null,null,null,null,null,null,null,{"$f":"IF(ISERROR(IF(OR($AF10=\"\",$AF10=0),0,(IF(TEXT($AF10,\"[hh]:mm:ss\")<TEXT($AE10,\"[hh]:mm:ss\"),(1-$AE10+$AF10),$AF10-$AE10))+IF(OR($AH10=\"\",$AH10=0),0,(IF(TEXT($AH10,\"[hh]:mm:ss\")<TEXT($AG10,\"[hh]:mm:ss\"),(1-$AG10+$AH10),$AH10-$AG10))+IF(OR($AJ10=\"\",$AJ10=0),0,(IF(TEXT($AJ10,\"[hh]:mm:ss\")<TEXT($AI10,\"[hh]:mm:ss\"),(1-$AI10+$AJ10),$AJ10-$AI10)))))),0,IF(OR($AF10=\"\",$AF10=0),0,(IF(TEXT($AF10,\"[hh]:mm:ss\")<TEXT($AE10,\"[hh]:mm:ss\"),(1-$AE10+$AF10),$AF10-$AE10))+IF(OR($AH10=\"\",$AH10=0),0,(IF(TEXT($AH10,\"[hh]:mm:ss\")<TEXT($AG10,\"[hh]:mm:ss\"),(1-$AG10+$AH10),$AH10-$AG10))+IF(OR($AJ10=\"\",$AJ10=0),0,(IF(TEXT($AJ10,\"[hh]:mm:ss\")<TEXT($AI10,\"[hh]:mm:ss\"),(1-$AI10+$AJ10),$AJ10-$AI10))))))","v":0},null,0,null,null,null,0,null,null,null,{"$f":"IF($C10=\"\",0,IF($S10<=VLOOKUP($C10,PREMISSAS!$C$6:$J$13,4,FALSE),$S10,VLOOKUP($C10,PREMISSAS!$C$6:$J$13,4,FALSE)))","v":0},null,{"$f":"IF($C10=\"\",0,IF($S10>VLOOKUP($C10,PREMISSAS!$C$6:$J$13,4,FALSE),$S10-VLOOKUP($C10,PREMISSAS!$C$6:$J$13,4,FALSE),0))","v":0},4,"QUARTA",0.33333333333333331,4,null,{"$f":"IF(OR(F10=\"\",F10=0,F10=\"FALTA\",F10=\"SUSPENSO\",F10=\"SUSPENSÃO\"),\"\",TEXT(F10,\"##\"\":\"\"##\"))","v":""},{"$f":"IF(OR(G10=\"\",G10=0,G10=\"FALTA\",G10=\"SUSPENSO\",G10=\"SUSPENSÃO\"),\"\",TEXT(G10,\"##\"\":\"\"##\"))","v":""},{"$f":"IF(OR(H10=\"\",H10=0,H10=\"FALTA\",H10=\"SUSPENSO\",H10=\"SUSPENSÃO\"),\"\",TEXT(H10,\"##\"\":\"\"##\"))","v":""},{"$f":"IF(OR(I10=\"\",I10=0,I10=\"FALTA\",I10=\"SUSPENSO\",I10=\"SUSPENSÃO\"),\"\",TEXT(I10,\"##\"\":\"\"##\"))","v":""},{"$f":"IF(OR(J10=\"\",J10=0,J10=\"FALTA\",J10=\"SUSPENSO\",J10=\"SUSPENSÃO\"),\"\",TEXT(J10,\"##\"\":\"\"##\"))","v":""},{"$f":"IF(OR(K10=\"\",K10=0,K10=\"FALTA\",K10=\"SUSPENSO\",K10=\"SUSPENSÃO\"),\"\",TEXT(K10,\"##\"\":\"\"##\"))","v":""},{"$f":"IF(OR(U10=\"\",U10=0,U10=\"FALTA\",U10=\"SUSPENSO\",U10=\"SUSPENSÃO\"),\"\",TEXT(TEXT(U10,\"00\"\":\"\"00\"),\"[hh]:mm\")*1)","v":""}]
[null,null,4,{"$f":"IF(D10=\"\",\"\",IF((D10+1)>'PERIODOS E FERIADOS'!$G$6,\"\",D10+1))","v":"2023-05-03"},"Quarta",null,null,null,null,null,null,null,0,null,0,null,null,null,0,null,null,null,{"$f":"IF($C11=\"\",0,IF($S11<=VLOOKUP($C11,PREMISSAS!$C$6:$J$13,4,FALSE),$S11,VLOOKUP($C11,PREMISSAS!$C$6:$J$13,4,FALSE)))","v":0},null,{"$f":"IF($C11=\"\",0,IF($S11>VLOOKUP($C11,PREMISSAS!$C$6:$J$13,4,FALSE),$S11-VLOOKUP($C11,PREMISSAS!$C$6:$J$13,4,FALSE),0))","v":0},5,"QUINTA",0.33333333333333331,5,null,"","","","","","",""]
[null,null,5,{"$f":"IF(D11=\"\",\"\",IF((D11+1)>'PERIODOS E FERIADOS'!$G$6,\"\",D11+1))","v":"2023-05-04"},"Quinta",null,null,null,null,null,null,null,0,null,0,null,null,null,0,null,null,null,{"$f":"IF($C12=\"\",0,IF($S12<=VLOOKUP($C12,PREMISSAS!$C$6:$J$13,4,FALSE),$S12,VLOOKUP($C12,PREMISSAS!$C$6:$J$13,4,FALSE)))","v":0},null,{"$f":"IF($C12=\"\",0,IF($S12>VLOOKUP($C12,PREMISSAS!$C$6:$J$13,4,FALSE),$S12-VLOOKUP($C12,PREMISSAS!$C$6:$J$13,4,FALSE),0))","v":0},6,"SEXTA",0.33333333333333331,6,null,"","","","","","",{"$f":"IF(OR(U12=\"\",U12=0,U12=\"FALTA\",U12=\"SUSPENSO\",U12=\"SUSPENSÃO\"),\"\",TEXT(TEXT(U12,\"##\"\":\"\"##\"),\"[hh]:mm\")*1)","v":""}]
[null,null,6,{"$f":"IF(D12=\"\",\"\",IF((D12+1)>'PERIODOS E FERIADOS'!$G$6,\"\",D12+1))","v":"2023-05-05"},"Sexta",null,null,null,null,null,null,null,0,null,0,null,null,null,0,null,null,null,{"$f":"IF($C13=\"\",0,IF($S13<=VLOOKUP($C13,PREMISSAS!$C$6:$J$13,4,FALSE),$S13,VLOOKUP($C13,PREMISSAS!$C$6:$J$13,4,FALSE)))","v":0},null,{"$f":"IF($C13=\"\",0,IF($S13>VLOOKUP($C13,PREMISSAS!$C$6:$J$13,4,FALSE),$S13-VLOOKUP($C13,PREMISSAS!$C$6:$J$13,4,FALSE),0))","v":0},7,"SÁBADO",0.16666666666666666,7,null,"","","","","","",""]
[null,null,7,{"$f":"IF(D13=\"\",\"\",IF((D13+1)>'PERIODOS E FERIADOS'!$G$6,\"\",D13+1))","v":"2023-05-06"},"Sábado",null,null,null,null,null,null,null,0,null,0,null,null,null,0,null,null,null,{"$f":"IF($C14=\"\",0,IF($S14<=VLOOKUP($C14,PREMISSAS!$C$6:$J$13,4,FALSE),$S14,VLOOKUP($C14,PREMISSAS!$C$6:$J$13,4,FALSE)))","v":0},null,{"$f":"IF($C14=\"\",0,IF($S14>VLOOKUP($C14,PREMISSAS!$C$6:$J$13,4,FALSE),$S14-VLOOKUP($C14,PREMISSAS!$C$6:$J$13,4,FALSE),0))","v":0},1,"DOMINGO",0,1,null,"","","","","","",""]
[null,null,1,{"$f":"IF(D14=\"\",\"\",IF((D14+1)>'PERIODOS E FERIADOS'!$G$6,\"\",D14+1))","v":"2023-05-07"},"Domingo",null,null,null,null,null,null,null,0,null,0,null,null,null,0,null,null,null,{"$f":"IF($C15=\"\",0,IF($S15<=VLOOKUP($C15,PREMISSAS!$C$6:$J$13,4,FALSE),$S15,VLOOKUP($C15,PREMISSAS!$C$6:$J$13,4,FALSE)))","v":0},null,{"$f":"IF($C15=\"\",0,IF($S15>VLOOKUP($C15,PREMISSAS!$C$6:$J$13,4,FALSE),$S15-VLOOKUP($C15,PREMISSAS!$C$6:$J$13,4,FALSE),0))","v":0},"F","FERIADOS",0,"F",null,"","","","","","",""]
[null,null,2,{"$f":"IF(D15=\"\",\"\",IF((D15+1)>'PERIODOS E FERIADOS'!$G$6,\"\",D15+1))","v":"2023-05-08"},"Segunda",null,null,null,null,null,null,null,0,null,0,null,null,null,0,null,null,null,{"$f":"IF($C16=\"\",0,IF($S16<=VLOOKUP($C16,PREMISSAS!$C$6:$J$13,4,FALSE),$S16,VLOOKUP($C16,PREMISSAS!$C$6:$J$13,4,FALSE)))","v":0},null,{"$f":"IF($C16=\"\",0,IF($S16>VLOOKUP($C16,PREMISSAS!$C$6:$J$13,4,FALSE),$S16-VLOOKUP($C16,PREMISSAS!$C$6:$J$13,4,FALSE),0))","v":0},null,"TOTAL SEMANA",{"$f":"SUM(AB8:AB15)","v":1.8333333333333333},null,null,"","","","","","",""]
[null,null,3,{"$f":"IF(D16=\"\",\"\",IF((D16+1)>'PERIODOS E FERIADOS'!$G$6,\"\",D16+1))","v":"2023-05-09"},"Terça",null,null,null,null,null,null,null,0,null,0,null,null,null,0,null,null,null,{"$f":"IF($C17=\"\",0,IF($S17<=VLOOKUP($C17,PREMISSAS!$C$6:$J$13,4,FALSE),$S17,VLOOKUP($C17,PREMISSAS!$C$6:$J$13,4,FALSE)))","v":0},null,{"$f":"IF($C17=\"\",0,IF($S17>VLOOKUP($C17,PREMISSAS!$C$6:$J$13,4,FALSE),$S17-VLOOKUP($C17,PREMISSAS!$C$6:$J$13,4,FALSE),0))","v":0},null,"JORNADA MENSAL",{"$f":"AB16*5","v":9.1666666666666661},null,null,"","","","","","",""]
[null,null,4,{"$f":"IF(D17=\"\",\"\",IF((D17+1)>'PERIODOS E FERIADOS'!$G$6,\"\",D17+1))","v":"2023-05-10"},"Quarta",null,null,null,null,null,null,null,0,null,0,null,null,null,0,null,null,null,{"$f":"IF($C18=\"\",0,IF($S18<=VLOOKUP($C18,PREMISSAS!$C$6:$J$13,4,FALSE),$S18,VLOOKUP($C18,PREMISSAS!$C$6:$J$13,4,FALSE)))","v":0},null,{"$f":"IF($C18=\"\",0,IF($S18>VLOOKUP($C18,PREMISSAS!$C$6:$J$13,4,FALSE),$S18-VLOOKUP($C18,PREMISSAS!$C$6:$J$13,4,FALSE),0))","v":0},null,null,null,null,null,"","","","","","",""]
[null,null,5,{"$f":"IF(D18=\"\",\"\",IF((D18+1)>'PERIODOS E FERIADOS'!$G$6,\"\",D18+1))","v":"2023-05-11"},"Quinta",null,null,null,null,null,null,null,0,null,0,null,null,null,0,null,null,null,{"$f":"IF($C19=\"\",0,IF($S19<=VLOOKUP($C19,PREMISSAS!$C$6:$J$13,4,FALSE),$S19,VLOOKUP($C19,PREMISSAS!$C$6:$J$13,4,FALSE)))","v":0},null,{"$f":"IF($C19=\"\",0,IF($S19>VLOOKUP($C19,PREMISSAS!$C$6:$J$13,4,FALSE),$S19-VLOOKUP($C19,PREMISSAS!$C$6:$J$13,4,FALSE),0))","v":0},null,{"$f":"IF(AB$16>AB$23,\"Jornada Superior a permitida\",IF(AB$16<=AB$23,\"\"))","v":""},null,null,null,"","","","","","",""]
[null,null,6,{"$f":"IF(D19=\"\",\"\",IF((D19+1)>'PERIODOS E FERIADOS'!$G$6,\"\",D19+1))","v":"2023-05-12"},"Sexta",null,null,null,null,null,null,null,0,null,0,null,null,null,0,null,null,null,{"$f":"IF($C20=\"\",0,IF($S20<=VLOOKUP($C20,PREMISSAS!$C$6:$J$13,4,FALSE),$S20,VLOOKUP($C20,PREMISSAS!$C$6:$J$13,4,FALSE)))","v":0},null,{"$f":"IF($C20=\"\",0,IF($S20>VLOOKUP($C20,PREMISSAS!$C$6:$J$13,4,FALSE),$S20-VLOOKUP($C20,PREMISSAS!$C$6:$J$13,4,FALSE),0))","v":0},null,{"$f":"IF(AB$16>AB$23,\"\",IF(AB$16<=AB$23,\"Jornada Ok\"))","v":"Jornada Ok"},null,null,null,"","","","","","",""]
[null,null,7,{"$f":"IF(D20=\"\",\"\",IF((D20+1)>'PERIODOS E FERIADOS'!$G$6,\"\",D20+1))","v":"2023-05-13"},"Sábado",null,null,null,null,null,null,null,0,null,0,null,null,null,0,null,null,null,{"$f":"IF($C21=\"\",0,IF($S21<=VLOOKUP($C21,PREMISSAS!$C$6:$J$13,4,FALSE),$S21,VLOOKUP($C21,PREMISSAS!$C$6:$J$13,4,FALSE)))","v":0},null,{"$f":"IF($C21=\"\",0,IF($S21>VLOOKUP($C21,PREMISSAS!$C$6:$J$13,4,FALSE),$S21-VLOOKUP($C21,PREMISSAS!$C$6:$J$13,4,FALSE),0))","v":0},null,null,null,null,null,"","","","","","",""]
[null,null,1,{"$f":"IF(D21=\"\",\"\",IF((D21+1)>'PERIODOS E FERIADOS'!$G$6,\"\",D21+1))","v":"2023-05-14"},"Domingo",null,null,null,null,null,null,null,0,null,0,null,null,null,0,null,null,null,{"$f":"IF($C22=\"\",0,IF($S22<=VLOOKUP($C22,PREMISSAS!$C$6:$J$13,4,FALSE),$S22,VLOOKUP($C22,PREMISSAS!$C$6:$J$13,4,FALSE)))","v":0},null,{"$f":"IF($C22=\"\",0,IF($S22>VLOOKUP($C22,PREMISSAS!$C$6:$J$13,4,FALSE),$S22-VLOOKUP($C22,PREMISSAS!$C$6:$J$13,4,FALSE),0))","v":0},null,null,null,null,null,"","","","","","",""]
[null,null,2,{"$f":"IF(D22=\"\",\"\",IF((D22+1)>'PERIODOS E FERIADOS'!$G$6,\"\",D22+1))","v":"2023-05-15"},"Segunda",null,null,null,null,null,null,null,0,null,0,null,null,null,0,null,null,null,{"$f":"IF($C23=\"\",0,IF($S23<=VLOOKUP($C23,PREMISSAS!$C$6:$J$13,4,FALSE),$S23,VLOOKUP($C23,PREMISSAS!$C$6:$J$13,4,FALSE)))","v":0},null,{"$f":"IF($C23=\"\",0,IF($S23>VLOOKUP($C23,PREMISSAS!$C$6:$J$13,4,FALSE),$S23-VLOOKUP($C23,PREMISSAS!$C$6:$J$13,4,FALSE),0))","v":0},null,"Jornada Maxima",1.8333333333333333,null,null,"","","","","","",""]
[null,null,3,{"$f":"IF(D23=\"\",\"\",IF((D23+1)>'PERIODOS E FERIADOS'!$G$6,\"\",D23+1))","v":"2023-05-16"},"Terça",null,null,null,null,null,null,null,0,null,0,null,null,null,0,null,null,null,{"$f":"IF($C24=\"\",0,IF($S24<=VLOOKUP($C24,PREMISSAS!$C$6:$J$13,4,FALSE),$S24,VLOOKUP($C24,PREMISSAS!$C$6:$J$13,4,FALSE)))","v":0},null,{"$f":"IF($C24=\"\",0,IF($S24>VLOOKUP($C24,PREMISSAS!$C$6:$J$13,4,FALSE),$S24-VLOOKUP($C24,PREMISSAS!$C$6:$J$13,4,FALSE),0))","v":0},null,null,null,null,null,"","","","","","",""]
[null,null,4,{"$f":"IF(D24=\"\",\"\",IF((D24+1)>'PERIODOS E FERIADOS'!$G$6,\"\",D24+1))","v":"2023-05-17"},"Quarta",null,null,null,null,null,null,null,0,null,0,null,null,null,0,null,null,null,{"$f":"IF($C25=\"\",0,IF($S25<=VLOOKUP($C25,PREMISSAS!$C$6:$J$13,4,FALSE),$S25,VLOOKUP($C25,PREMISSAS!$C$6:$J$13,4,FALSE)))","v":0},null,{"$f":"IF($C25=\"\",0,IF($S25>VLOOKUP($C25,PREMISSAS!$C$6:$J$13,4,FALSE),$S25-VLOOKUP($C25,PREMISSAS!$C$6:$J$13,4,FALSE),0))","v":0},null,null,null,null,null,"","","","","","",""]
[null,null,5,{"$f":"IF(D25=\"\",\"\",IF((D25+1)>'PERIODOS E FERIADOS'!$G$6,\"\",D25+1))","v":"2023-05-18"},"Quinta",null,null,null,null,null,null,null,0,null,0,null,null,null,0,null,null,null,{"$f":"IF($C26=\"\",0,IF($S26<=VLOOKUP($C26,PREMISSAS!$C$6:$J$13,4,FALSE),$S26,VLOOKUP($C26,PREMISSAS!$C$6:$J$13,4,FALSE)))","v":0},null,{"$f":"IF($C26=\"\",0,IF($S26>VLOOKUP($C26,PREMISSAS!$C$6:$J$13,4,FALSE),$S26-VLOOKUP($C26,PREMISSAS!$C$6:$J$13,4,FALSE),0))","v":0},null,null,null,null,null,"","","","","","",""]
[null,null,6,{"$f":"IF(D26=\"\",\"\",IF((D26+1)>'PERIODOS E FERIADOS'!$G$6,\"\",D26+1))","v":"2023-05-19"},"Sexta",null,null,null,null,null,null,null,0,null,0,null,null,null,0,null,null,null,{"$f":"IF($C27=\"\",0,IF($S27<=VLOOKUP($C27,PREMISSAS!$C$6:$J$13,4,FALSE),$S27,VLOOKUP($C27,PREMISSAS!$C$6:$J$13,4,FALSE)))","v":0},null,{"$f":"IF($C27=\"\",0,IF($S27>VLOOKUP($C27,PREMISSAS!$C$6:$J$13,4,FALSE),$S27-VLOOKUP($C27,PREMISSAS!$C$6:$J$13,4,FALSE),0))","v":0},null,null,null,null,null,"","","","","","",""]
[null,null,7,{"$f":"IF(D27=\"\",\"\",IF((D27+1)>'PERIODOS E FERIADOS'!$G$6,\"\",D27+1))","v":"2023-05-20"},"Sábado",null,null,null,null,null,null,null,0,null,0,null,null,null,0,null,null,null,{"$f":"IF($C28=\"\",0,IF($S28<=VLOOKUP($C28,PREMISSAS!$C$6:$J$13,4,FALSE),$S28,VLOOKUP($C28,PREMISSAS!$C$6:$J$13,4,FALSE)))","v":0},null,{"$f":"IF($C28=\"\",0,IF($S28>VLOOKUP($C28,PREMISSAS!$C$6:$J$13,4,FALSE),$S28-VLOOKUP($C28,PREMISSAS!$C$6:$J$13,4,FALSE),0))","v":0},null,null,null,null,null,"","","","","","",""]
[null,null,1,{"$f":"IF(D28=\"\",\"\",IF((D28+1)>'PERIODOS E FERIADOS'!$G$6,\"\",D28+1))","v":"2023-05-21"},"Domingo",null,null,null,null,null,null,null,0,null,0,null,null,null,0,null,null,null,{"$f":"IF($C29=\"\",0,IF($S29<=VLOOKUP($C29,PREMISSAS!$C$6:$J$13,4,FALSE),$S29,VLOOKUP($C29,PREMISSAS!$C$6:$J$13,4,FALSE)))","v":0},null,{"$f":"IF($C29=\"\",0,IF($S29>VLOOKUP($C29,PREMISSAS!$C$6:$J$13,4,FALSE),$S29-VLOOKUP($C29,PREMISSAS!$C$6:$J$13,4,FALSE),0))","v":0},null,null,null,null,null,"","","","","","",""]
[null,null,2,{"$f":"IF(D29=\"\",\"\",IF((D29+1)>'PERIODOS E FERIADOS'!$G$6,\"\",D29+1))","v":"2023-05-22"},"Segunda",null,null,null,null,null,null,null,0,null,0,null,null,null,0,null,null,null,{"$f":"IF($C30=\"\",0,IF($S30<=VLOOKUP($C30,PREMISSAS!$C$6:$J$13,4,FALSE),$S30,VLOOKUP($C30,PREMISSAS!$C$6:$J$13,4,FALSE)))","v":0},null,{"$f":"IF($C30=\"\",0,IF($S30>VLOOKUP($C30,PREMISSAS!$C$6:$J$13,4,FALSE),$S30-VLOOKUP($C30,PREMISSAS!$C$6:$J$13,4,FALSE),0))","v":0},null,null,null,null,null,"","","","","","",""]
[null,null,3,{"$f":"IF(D30=\"\",\"\",IF((D30+1)>'PERIODOS E FERIADOS'!$G$6,\"\",D30+1))","v":"2023-05-23"},"Terça",null,null,null,null,null,null,null,0,null,0,null,null,null,0,null,null,null,{"$f":"IF($C31=\"\",0,IF($S31<=VLOOKUP($C31,PREMISSAS!$C$6:$J$13,4,FALSE),$S31,VLOOKUP($C31,PREMISSAS!$C$6:$J$13,4,FALSE)))","v":0},null,{"$f":"IF($C31=\"\",0,IF($S31>VLOOKUP($C31,PREMISSAS!$C$6:$J$13,4,FALSE),$S31-VLOOKUP($C31,PREMISSAS!$C$6:$J$13,4,FALSE),0))","v":0},null,null,null,null,null,"","","","","","",""]
[null,null,4,{"$f":"IF(D31=\"\",\"\",IF((D31+1)>'PERIODOS E FERIADOS'!$G$6,\"\",D31+1))","v":"2023-05-24"},"Quarta",null,null,null,null,null,null,null,0,null,0,null,null,null,0,null,null,null,{"$f":"IF($C32=\"\",0,IF($S32<=VLOOKUP($C32,PREMISSAS!$C$6:$J$13,4,FALSE),$S32,VLOOKUP($C32,PREMISSAS!$C$6:$J$13,4,FALSE)))","v":0},null,{"$f":"IF($C32=\"\",0,IF($S32>VLOOKUP($C32,PREMISSAS!$C$6:$J$13,4,FALSE),$S32-VLOOKUP($C32,PREMISSAS!$C$6:$J$13,4,FALSE),0))","v":0},null,null,null,null,null,{"$f":"IF(OR(F32=\"\",F32=0,F32=\"FALTA\",F32=\"SUSPENSO\",F32=\"SUSPENSÃO\"),\"\",TEXT(F32,\"##\"\":\"\"##\"))","v":""},{"$f":"IF(OR(G32=\"\",G32=0,G32=\"FALTA\",G32=\"SUSPENSO\",G32=\"SUSPENSÃO\"),\"\",TEXT(G32,\"##\"\":\"\"##\"))","v":""},"","",{"$f":"IF(OR(J32=\"\",J32=0,J32=\"FALTA\",J32=\"SUSPENSO\",J32=\"SUSPENSÃO\"),\"\",TEXT(J32,\"##\"\":\"\"##\"))","v":""},{"$f":"IF(OR(K32=\"\",K32=0,K32=\"FALTA\",K32=\"SUSPENSO\",K32=\"SUSPENSÃO\"),\"\",TEXT(K32,\"##\"\":\"\"##\"))","v":""},""]
[null,null,5,{"$f":"IF(D32=\"\",\"\",IF((D32+1)>'PERIODOS E FERIADOS'!$G$6,\"\",D32+1))","v":"2023-05-25"},"Quinta",null,null,null,null,null,null,null,0,null,0,null,null,null,0,null,null,null,{"$f":"IF($C33=\"\",0,IF($S33<=VLOOKUP($C33,PREMISSAS!$C$6:$J$13,4,FALSE),$S33,VLOOKUP($C33,PREMISSAS!$C$6:$J$13,4,FALSE)))","v":0},null,{"$f":"IF($C33=\"\",0,IF($S33>VLOOKUP($C33,PREMISSAS!$C$6:$J$13,4,FALSE),$S33-VLOOKUP($C33,PREMISSAS!$C$6:$J$13,4,FALSE),0))","v":0},null,null,null,null,null,{"$f":"IF(OR(F33=\"\",F33=0,F33=\"FALTA\",F33=\"SUSPENSO\",F33=\"SUSPENSÃO\"),\"\",TEXT(F33,\"##\"\":\"\"##\"))","v":""},"","","","","",""]
[null,null,6,{"$f":"IF(D33=\"\",\"\",IF((D33+1)>'PERIODOS E FERIADOS'!$G$6,\"\",D33+1))","v":"2023-05-26"},"Sexta",null,null,null,null,null,null,null,0,null,0,null,null,null,0,null,null,null,{"$f":"IF($C34=\"\",0,IF($S34<=VLOOKUP($C34,PREMISSAS!$C$6:$J$13,4,FALSE),$S34,VLOOKUP($C34,PREMISSAS!$C$6:$J$13,4,FALSE)))","v":0},null,{"$f":"IF($C34=\"\",0,IF($S34>VLOOKUP($C34,PREMISSAS!$C$6:$J$13,4,FALSE),$S34-VLOOKUP($C34,PREMISSAS!$C$6:$J$13,4,FALSE),0))","v":0},null,null,null,null,null,"","","","","","",""]
[null,null,7,{"$f":"IF(D34=\"\",\"\",IF((D34+1)>'PERIODOS E FERIADOS'!$G$6,\"\",D34+1))","v":"2023-05-27"},"Sábado",null,null,null,null,null,null,null,0,null,0,null,null,null,0,null,null,null,{"$f":"IF($C35=\"\",0,IF($S35<=VLOOKUP($C35,PREMISSAS!$C$6:$J$13,4,FALSE),$S35,VLOOKUP($C35,PREMISSAS!$C$6:$J$13,4,FALSE)))","v":0},null,{"$f":"IF($C35=\"\",0,IF($S35>VLOOKUP($C35,PREMISSAS!$C$6:$J$13,4,FALSE),$S35-VLOOKUP($C35,PREMISSAS!$C$6:$J$13,4,FALSE),0))","v":0},null,null,null,null,null,"","","","","","",""]
[null,null,1,{"$f":"IF(D35=\"\",\"\",IF((D35+1)>'PERIODOS E FERIADOS'!$G$6,\"\",D35+1))","v":"2023-05-28"},"Domingo",null,null,null,null,null,null,null,0,null,0,null,null,null,0,null,null,null,{"$f":"IF($C36=\"\",0,IF($S36<=VLOOKUP($C36,PREMISSAS!$C$6:$J$13,4,FALSE),$S36,VLOOKUP($C36,PREMISSAS!$C$6:$J$13,4,FALSE)))","v":0},null,{"$f":"IF($C36=\"\",0,IF($S36>VLOOKUP($C36,PREMISSAS!$C$6:$J$13,4,FALSE),$S36-VLOOKUP($C36,PREMISSAS!$C$6:$J$13,4,FALSE),0))","v":0},null,null,null,null,null,"","","","","","",""]
[null,null,2,{"$f":"IF(D36=\"\",\"\",IF((D36+1)>'PERIODOS E FERIADOS'!$G$6,\"\",D36+1))","v":"2023-05-29"},"Segunda",null,null,null,null,null,null,null,0,null,0,null,null,null,0,null,null,null,{"$f":"IF($C37=\"\",0,IF($S37<=VLOOKUP($C37,PREMISSAS!$C$6:$J$13,4,FALSE),$S37,VLOOKUP($C37,PREMISSAS!$C$6:$J$13,4,FALSE)))","v":0},null,{"$f":"IF($C37=\"\",0,IF($S37>VLOOKUP($C37,PREMISSAS!$C$6:$J$13,4,FALSE),$S37-VLOOKUP($C37,PREMISSAS!$C$6:$J$13,4,FALSE),0))","v":0},null,null,null,null,null,"","","","","","",""]
[null,null,3,{"$f":"IF(D37=\"\",\"\",IF((D37+1)>'PERIODOS E FERIADOS'!$G$6,\"\",D37+1))","v":"2023-05-30"},"Terça",null,null,null,null,null,null,null,0,null,0,null,null,null,0,null,null,null,{"$f":"IF($C38=\"\",0,IF($S38<=VLOOKUP($C38,PREMISSAS!$C$6:$J$13,4,FALSE),$S38,VLOOKUP($C38,PREMISSAS!$C$6:$J$13,4,FALSE)))","v":0},null,{"$f":"IF($C38=\"\",0,IF($S38>VLOOKUP($C38,PREMISSAS!$C$6:$J$13,4,FALSE),$S38-VLOOKUP($C38,PREMISSAS!$C$6:$J$13,4,FALSE),0))","v":0},null,null,null,null,null,"","","","","","",""]
[null,null,4,{"$f":"IF(D38=\"\",\"\",IF((D38+1)>'PERIODOS E FERIADOS'!$G$6,\"\",D38+1))","v":"2023-05-31"},"Quarta",null,null,null,null,null,null,null,0,null,0,null,null,null,0,null,null,null,{"$f":"IF($C39=\"\",0,IF($S39<=VLOOKUP($C39,PREMISSAS!$C$6:$J$13,4,FALSE),$S39,VLOOKUP($C39,PREMISSAS!$C$6:$J$13,4,FALSE)))","v":0},null,{"$f":"IF($C39=\"\",0,IF($S39>VLOOKUP($C39,PREMISSAS!$C$6:$J$13,4,FALSE),$S39-VLOOKUP($C39,PREMISSAS!$C$6:$J$13,4,FALSE),0))","v":0},null,null,null,null,null,"","","","","","",""]
[]
[null,null,null,"TOTAIS",null,null,"Faltas / Suspensão",null,{"$f":"COUNTIF($F$9:$F$39,\"FALTA\")+COUNTIF($F$9:$F$39,\"SUSPENSÃO\")+COUNTIF($F$9:$F$39,\"SUSPENSO\")+COUNTIF($F$9:$F$39,\"SUSPENSAO\")","v":0},null,null,null,{"$f":"SUM($M$9:$M$39)","v":0},null,{"$f":"SUM($O$9:$O$39)","v":0},null,null,null,{"$f":"SUM(S$9:S$39)","v":0},null,{"$f":"$AK$41","v":0},null,{"$f":"SUM(W$9:W$39)","v":0},null,{"$f":"SUM(Y$9:Y$39)","v":0},null,null,null,null,null,null,null,null,null,null,null,{"$f":"SUM(AK9:AK39)","v":0}]
[]
[null,null,null,"OBSERVAÇÕES:"]